program: Gaussian 09
title: 000249585
version: EM64L-G09RevD.01
frameworkgroup: C1[X(C19H34O2)]
method: RPBEPBE
basis: SDD
operation: Freq
keyword: #pfreq=noraman
keyword: PBEPBE/SDD
title: #p freq=noraman PBEPBE/SDD
converged: YES YES NO NO
title: Mulliken charges:
elementType: O O C C C C C C C C C C C C C C C C C C C H H H H H H H H H H H H H H H H H H H H H H H H H H H H H H H H H H
charge: -0.251320 -0.226233 -0.386664 -0.385876 -0.385533 -0.386355 -0.385110 -0.384646 -0.381786 -0.387150 -0.372907 -0.368235 -0.353262 -0.373295 -0.356683 -0.481936 -0.696699 0.153191 -0.164449 0.165838 -0.501970 0.193924 0.193830 0.193789 0.193683 0.193489 0.193289 0.194499 0.194681 0.193025 0.193038 0.194291 0.194349 0.191650 0.191898 0.197657 0.197741 0.189353 0.189281 0.194997 0.195139 0.187457 0.187625 0.218915 0.216505 0.194680 0.194729 0.243348 0.240270 0.209639 0.214953 0.209610 0.234114 0.242809 0.242827
chargesum: 0.00000
title: Mulliken charges with hydrogens summed into heavy atoms:
elementType: O O C C C C C C C C C C C C C C C C C C C
charge: -0.251320 -0.226233 0.001091 0.001595 0.001244 0.002825 0.000953 0.003993 0.001762 0.008248 0.005727 0.021901 0.021820 0.062125 0.032726 0.001682 -0.062498 0.153191 -0.164449 0.165838 0.217779
polarizability: 3.21592815e+02 1.99468858e+01 1.89858939e+02 -3.99623921e+00 1.07397705e+00 1.57385620e+02
1716.lowfreq: -27.6654 -7.1126 -2.9378 -0.0019 -0.0002 0.0018 1.8093 9.2693 12.3336
frequency: -21.9507 4.0891 12.1700 13.2501 29.1467 32.0520 38.4621 57.7150 60.2637 68.6470 89.1684 94.4368 99.7148 108.7351 113.9973 116.4769 119.6241 133.5597 140.5349 147.8014 150.6834 155.6294 185.0750 220.2146 227.7155 239.4501 260.3389 285.3550 329.7746 348.8716 373.2154 408.1557 428.0023 458.8712 491.8024 501.9462 551.6325 565.7725 702.3148 718.5542 719.1753 720.7138 724.3994 731.8497 746.0305 760.1743 768.9014 799.8374 837.6997 879.3978 887.4969 900.2468 922.7687 965.2453 972.9802 975.3792 998.4467 1002.9358 1004.0303 1025.6344 1034.1219 1043.6351 1044.3090 1056.8987 1070.0660 1078.1027 1079.1961 1081.8456 1082.2249 1091.0562 1107.8243 1108.9623 1123.9784 1145.4548 1179.2161 1193.2761 1195.4765 1213.0034 1218.1964 1226.3626 1233.8700 1240.2625 1253.1788 1260.1730 1269.7321 1277.2644 1278.9900 1281.2210 1284.2196 1286.8528 1292.3027 1293.4364 1297.7552 1297.8743 1299.6425 1317.1192 1331.9875 1343.9237 1351.3678 1353.0233 1354.5813 1356.8217 1357.4562 1389.2824 1420.8772 1446.7988 1451.4994 1457.9187 1457.9748 1460.1847 1460.3746 1461.3185 1462.7350 1463.0354 1465.2110 1468.7422 1472.9259 1476.9232 1477.2028 1480.9754 1484.2422 1486.6748 1487.9185 1600.8201 2268.0017 2947.4277 2947.6201 2948.9571 2949.0420 2950.2506 2951.3470 2951.9237 2954.3546 2958.0058 2961.7420 2965.0029 2966.7816 2967.3442 2971.3759 2980.4771 2982.3504 2984.9503 2988.3292 2991.2639 2992.6960 2998.1535 3002.6949 3005.3964 3011.5427 3014.8766 3023.0244 3031.0376 3037.9714 3042.9809 3059.3014 3068.0243 3069.5992 3103.3492 3149.0734
redmass: 1.8703 5.4169 4.1639 3.6002 3.6595 2.3444 2.6180 3.1821 2.8200 2.0672 2.0313 2.3884 3.8402 1.4741 4.7250 1.6136 2.1824 1.9721 2.1478 4.0167 2.0203 2.0680 3.9456 4.2609 1.1174 4.0774 3.8847 4.1892 3.5083 4.0406 4.1046 3.5083 3.7866 3.2242 3.2814 3.0028 9.3843 5.4775 11.6218 1.0576 1.0602 1.0696 1.0846 1.1094 1.1431 5.6000 1.1831 1.2175 1.2439 1.2535 1.9051 7.2614 1.2415 1.2108 5.3334 5.6662 4.9208 3.7004 1.1852 4.4463 1.0633 3.4398 4.3386 3.1665 2.7160 2.4406 2.0537 2.2272 2.1854 2.9940 1.3018 1.2770 3.0091 1.4538 1.9391 1.6467 1.2642 1.5006 1.3200 3.9904 1.4033 1.3485 1.3088 1.3270 1.2374 1.0153 1.2396 1.1334 1.1277 1.0697 1.1085 1.1024 1.1295 1.1194 1.3067 1.3818 1.4201 1.4707 1.5936 1.6701 1.6758 1.6273 1.6381 1.2175 1.1872 1.0831 1.0501 1.0740 1.0739 1.0721 1.0712 1.0522 1.0676 1.0656 1.0788 1.0860 1.0877 1.0581 1.0730 1.0915 1.0940 1.0957 1.0935 10.2453 11.8804 1.0585 1.0584 1.0587 1.0590 1.0590 1.0594 1.0591 1.0595 1.0592 1.0588 1.0584 1.0585 1.0585 1.0366 1.0960 1.0966 1.0975 1.0986 1.0598 1.0998 1.1018 1.0297 1.1032 1.1003 1.1039 1.1051 1.1052 1.1049 1.1046 1.1047 1.1007 1.0993 1.1044 1.1045
irintensity: 0.3030 1.7204 0.0699 0.0995 0.1440 0.0124 0.0264 0.3811 0.1883 0.3705 0.0597 2.2823 1.6049 1.2382 0.7321 0.3050 1.3286 0.8741 0.1574 1.6206 0.1276 0.0503 0.5151 0.6933 0.0002 0.2026 2.6461 10.7408 0.7541 1.8849 2.8471 1.0090 0.4811 1.4905 0.0074 0.2507 4.1014 0.8594 16.4338 20.6292 5.9003 7.8434 0.0647 3.7598 0.0471 13.8465 1.7891 0.1075 0.9937 0.1201 4.7418 9.2595 0.6758 0.1339 0.8305 0.5776 7.4839 0.7314 0.3173 30.2219 0.0599 11.1030 121.7527 53.0884 3.4385 1.3935 0.4715 0.0500 0.4708 3.7335 0.2800 0.2599 13.8475 37.3102 0.0695 3.0097 32.7779 0.8949 6.7484 268.3456 3.7617 7.3764 0.6481 6.3245 0.1136 0.0605 3.2502 2.0182 0.1355 0.0837 0.1959 0.1436 0.5606 0.2641 4.8861 5.4031 3.4858 2.8507 0.5551 0.3334 0.6041 0.2463 0.1247 11.3146 29.6232 4.6967 14.0334 0.0135 0.0266 0.0033 0.0737 9.7885 0.0256 0.2341 0.5598 0.1186 1.4882 8.1980 4.6955 2.1253 1.4687 9.3409 46.5210 273.1606 252.3113 0.0014 0.0735 0.0774 0.1048 0.5732 0.4230 4.6427 0.1221 4.8896 6.2192 168.7060 10.1605 245.7226 37.9217 0.0091 0.0523 0.1928 0.4900 42.1704 1.0313 0.7934 36.2179 0.7206 4.2553 0.2205 0.0824 11.9550 2.6135 346.1848 101.5647 97.6750 56.2326 27.2956 16.0139
temp: 298.150 k
press: 1.00000 atm
elementType: 8 8 6 6 6 6 6 6 6 6 6 6 6 6 6 6 6 6 6 6 6 1 1 1 1 1 1 1 1 1 1 1 1 1 1 1 1 1 1 1 1 1 1 1 1 1 1 1 1 1 1 1 1 1 1
symmnumber: 1
zpe: 1278465.4 jmol-1
zpe.correction: 0.486942 hartree
zpe.thermalcorrener: 0.514082 hartree
zpe.thermalcorrenthalpy: 0.515026 hartree
zpe.thermalcorrgfe: 0.421277 hartree
zpe.sumelectzpe: -893.105533 hartree
zpe.sumelectthermal: -893.078393 hartree
zpe.sumelectthermalent: -893.077449 hartree
zpe.sumelectthermalfe: -893.171198 hartree
dipole: -2.7848 0.8413 0.6376
dipole: 2.9782
quadrupole: -169.0307 -128.7287 -130.3251
quadrupole: 17.9056 7.4578 -0.6857
quadrupole: -26.3358 13.9661 12.3697 17.9056 7.4578 -0.6857
hfenergy: -893.5924751 hartree
pointgroup: C01 [X(C19H34O2)]
dipole: -1.0935698 -0.2694732 -0.3230903 debye
polarizability: 321.4325858|-20.8898967|188.2508128|1.4512816|7.222889|159.153975 unknown
InChI: InChI=1S/C19H34O2/c1-3-4-5-6-7-8-9-10-11-12-13-14-15-16-17-18-19(20)21-2/h3-16H2,1-2H3
charge 0 multiplicity 1
55 atoms
O  9.139969 -1.579157 -0.412268
O  10.170267 0.175839 0.74011
C  -3.486715 -0.255741 0.042188
C  -2.28072 0.708954 0.095872
C  -4.850958 0.470099 0.032361
C  -0.915443 -0.014936 0.100483
C  -6.05855 -0.492882 -0.015613
C  0.288461 0.951948 0.16095
C  -7.421936 0.23463 -0.027453
C  1.654475 0.229372 0.156785
C  -8.630626 -0.727377 -0.070582
C  2.85541 1.199238 0.225955
C  -9.993838 0.000564 -0.082387
C  4.217335 0.472043 0.209339
C  -11.202484 -0.962334 -0.122105
C  5.408715 1.468481 0.294584
C  -12.560424 -0.227344 -0.133341
C  6.72488 0.817162 0.26392
C  7.821389 0.248104 0.228825
C  9.1388 -0.334519 0.234276
C  10.460187 -2.254595 -0.456615
H  -3.444365 -0.944104 0.912288
H  -3.405432 -0.89431 -0.862515
H  -2.325797 1.399913 -0.772063
H  -2.361047 1.344719 1.002658
H  -4.894493 1.155754 -0.839873
H  -4.93041 1.111798 0.93506
H  -0.833216 -0.646687 -0.808822
H  -0.871864 -0.709302 0.965643
H  -6.016322 -1.177237 0.857697
H  -5.979043 -1.135959 -0.917312
H  0.208174 1.579165 1.073593
H  0.240601 1.650255 -0.70085
H  -7.499937 0.880131 0.872658
H  -7.465354 0.916832 -0.902397
H  1.737042 -0.392552 -0.758853
H  1.700401 -0.473145 1.014826
H  -8.553017 -1.373298 -0.970475
H  -8.587457 -1.409212 0.804726
H  2.804345 1.907126 -0.627895
H  2.775809 1.81464 1.146707
H  -10.072241 0.647909 0.81641
H  -10.039744 0.680748 -0.958828
H  4.314738 -0.129229 -0.714905
H  4.277356 -0.236835 1.057542
H  -11.12341 -1.608827 -1.020175
H  -11.155316 -1.641483 0.753768
H  5.321692 2.07328 1.219868
H  5.346926 2.185641 -0.549693
H  -12.678437 0.400886 0.769913
H  -13.406901 -0.938108 -0.163386
H  -12.644427 0.435942 -1.015075
H  10.272461 -3.197382 -0.988997
H  10.830051 -2.440351 0.566002
H  11.192042 -1.630068 -0.996434
