program: Gaussian 09
title: 000019789
version: EM64L-G09RevD.01
frameworkgroup: C1[X(C13H18N2O2)]
method: RPBEPBE
basis: SDD
operation: Freq
keyword: #p
keyword: freq=noraman
keyword: PBEPBE/SDD
title: #p freq=noraman PBEPBE/SDD
converged: YES YES NO NO
title: Mulliken charges:
elementType: O O N N C C C C C C C C C C C C C H H H H H H H H H H H H H H H H H H
charge: -0.245796 -0.204688 -0.101428 -0.238142 -0.368320 -0.417610 -0.328556 -0.329027 0.317823 0.174722 0.172939 -0.672701 -0.669467 -0.331070 -0.328099 -0.218475 -0.216135 0.225048 0.219953 0.239996 0.248791 0.208830 0.193179 0.218762 0.197091 0.203596 0.228861 0.212128 0.206981 0.226083 0.211297 0.245345 0.256398 0.228296 0.233397
chargesum: 0.00000
title: Mulliken charges with hydrogens summed into heavy atoms:
elementType: O O N N C C C C C C C C C C C C C
charge: -0.245796 -0.204688 -0.101428 -0.238142 0.076680 0.071177 0.073453 0.086826 0.317823 0.174722 0.172939 -0.028117 -0.025106 -0.085725 -0.071701 0.009820 0.017263
polarizability: 1.99988692e+02 -2.19488694e+01 1.80450520e+02 1.01732943e+01 7.02297989e+00 9.84911307e+01
1716.lowfreq: -17.0447 -8.8596 -2.6062 0.0008 0.0008 0.0010 15.0138 19.7261 41.8176
frequency: 11.5640 18.6777 41.6676 56.4082 67.7687 82.5376 127.2001 153.4174 173.1876 211.5211 228.0979 247.8128 281.6438 296.1657 305.0030 316.3288 363.3047 396.6937 426.9827 442.0511 477.0208 492.1170 566.0325 589.3936 595.5854 660.8170 678.3027 715.0650 728.6200 747.4102 757.7216 776.0212 793.4018 798.3966 826.7952 846.6446 883.1378 916.8620 921.8505 968.8409 988.7296 991.8894 1010.8695 1036.5078 1062.3191 1074.2905 1076.6958 1083.4628 1084.4668 1123.2675 1142.7795 1165.1579 1196.3604 1208.4582 1225.9190 1262.5765 1281.6420 1290.1359 1295.4394 1313.4926 1322.9325 1349.9093 1364.1830 1368.1470 1384.0873 1386.0831 1386.3491 1418.0946 1455.1048 1458.7169 1461.8639 1464.6323 1470.7930 1478.6085 1478.6851 1484.8830 1486.5058 1490.6474 1616.6774 1627.3288 1734.0279 2862.1340 2871.8447 2902.1738 2979.4587 2983.4017 3024.3025 3028.2125 3037.2372 3040.7760 3071.5435 3076.0322 3090.7529 3091.6706 3095.2186 3139.2117 3152.9124 3167.3652 3183.8209
redmass: 3.8889 4.1782 3.0695 3.1771 2.9462 2.0804 7.1726 1.6441 3.2895 1.3375 1.7945 1.9677 2.6386 2.8166 3.5586 5.1824 4.3364 3.0837 3.2689 2.8092 3.1297 6.0027 4.0874 5.2795 7.1200 7.4122 9.6470 5.0356 4.8011 1.2527 2.4068 1.2521 1.2072 1.2491 7.9572 1.3644 4.3465 2.0965 1.3783 1.2979 3.2875 2.7576 1.9602 3.7349 2.4549 2.3456 2.0856 2.0860 2.4269 1.6633 1.6257 1.1582 2.2207 2.2443 2.8583 1.4095 1.1604 1.2547 1.2995 1.3862 1.9459 2.4740 1.3413 1.3513 1.3343 1.2559 1.2356 3.9472 1.3608 1.8470 1.0566 1.1079 1.0560 3.1122 1.0525 1.0817 1.0706 1.0802 7.7441 8.1146 12.0601 1.0720 1.0712 1.0703 1.0361 1.0357 1.0882 1.0599 1.0876 1.0902 1.0977 1.0984 1.1004 1.1004 1.1054 1.0861 1.0915 1.0966 1.0982
irintensity: 1.2390 0.9024 0.2345 0.0366 0.1641 0.1010 0.8116 0.5816 1.5184 1.0173 1.3881 1.3935 1.3366 2.4045 2.4574 1.6935 1.5615 8.9240 5.5641 2.6180 6.6814 1.6823 2.6735 14.0331 5.7728 25.0466 6.5999 9.6916 0.2134 122.5049 15.9395 10.9290 4.7654 4.2820 31.9583 0.3386 46.5382 5.0772 4.3183 0.0885 23.3009 16.0824 11.6185 4.0411 17.3855 12.9533 39.5365 6.5560 8.4520 17.9348 23.8104 8.6876 46.4531 29.6579 32.6437 16.3774 6.3379 13.7192 24.2911 23.2232 51.2335 36.2773 0.7892 12.1091 2.9162 21.1543 18.8584 2.4344 6.8578 15.5255 8.2331 7.5216 2.4565 135.4565 2.7303 23.0149 14.2720 14.9612 34.9601 11.4124 603.7838 45.4173 130.7641 82.6389 26.6519 30.9782 14.3533 20.2383 9.4992 19.6739 65.5177 62.0356 26.4409 54.0961 9.2839 2.1290 14.9326 14.6937 6.1725
temp: 298.150 k
press: 1.00000 atm
elementType: 8 8 7 7 6 6 6 6 6 6 6 6 6 6 6 6 6 1 1 1 1 1 1 1 1 1 1 1 1 1 1 1 1 1 1
symmnumber: 1
zpe: 761954.6 jmol-1
zpe.correction: 0.290213 hartree
zpe.thermalcorrener: 0.307267 hartree
zpe.thermalcorrenthalpy: 0.308211 hartree
zpe.thermalcorrgfe: 0.242345 hartree
zpe.sumelectzpe: -764.845894 hartree
zpe.sumelectthermal: -764.828840 hartree
zpe.sumelectthermalent: -764.827896 hartree
zpe.sumelectthermalfe: -764.893762 hartree
dipole: 1.4193 4.7450 0.0481
dipole: 4.9530
quadrupole: -90.3705 -112.1920 -103.8677
quadrupole: -7.5528 -1.4968 -1.1079
quadrupole: 11.7729 -10.0486 -1.7243 -7.5528 -1.4968 -1.1079
hfenergy: -765.1361071 hartree
pointgroup: C01 [X(C13H18N2O2)]
dipole: -0.5605139 -1.8140444 -0.4385285 debye
polarizability: 199.7142432|-18.5762066|178.7405562|-16.3324248|13.6851131|100.4755429 unknown
InChI: InChI=1S/C13H18N2O2/c1-3-14(4-2)9-10-15-11-7-5-6-8-12(11)17-13(15)16/h5-8H,3-4,9-10H2,1-2H3
charge 0 multiplicity 1
35 atoms
O  2.458072 1.889376 0.16759
O  0.438408 3.017603 0.730502
N  -3.057097 -0.218961 -0.065344
N  0.587989 0.633404 0.582811
C  -1.648152 0.067115 -0.41484
C  -0.813682 0.294723 0.871794
C  -3.704603 -1.220223 -0.954371
C  -3.868288 1.018586 0.116472
C  1.625416 -0.267788 0.263739
C  2.778883 0.518511 0.014488
C  1.049757 1.957308 0.525762
C  -3.220802 -2.658916 -0.692144
C  -5.039962 0.829707 1.098309
C  1.676126 -1.670035 0.182505
C  4.014119 -0.036889 -0.323674
C  2.9243 -2.250848 -0.159179
C  4.069847 -1.453585 -0.408273
H  -1.545134 0.960332 -1.075663
H  -1.226119 -0.790541 -0.968856
H  -0.849343 -0.612192 1.500093
H  -1.239796 1.12983 1.453355
H  -4.792365 -1.176657 -0.765268
H  -3.56143 -0.962343 -2.034046
H  -3.200989 1.808691 0.508574
H  -4.251145 1.394753 -0.864961
H  -2.137512 -2.772736 -0.884235
H  -3.413742 -2.939122 0.358054
H  -3.749905 -3.370648 -1.352865
H  -5.752646 0.060654 0.748554
H  -4.661757 0.516724 2.086984
H  -5.600342 1.77586 1.215825
H  0.79676 -2.292197 0.376169
H  4.889194 0.590801 -0.510488
H  3.002885 -3.340681 -0.231702
H  5.017055 -1.935717 -0.670068
