program: Gaussian 09
title: 000249574
version: EM64L-G09RevD.01
frameworkgroup: C1[X(C12H24O3)]
method: RPBEPBE
basis: SDD
operation: Freq
keyword: #pfreq=noraman
keyword: PBEPBE/SDD
title: #p freq=noraman PBEPBE/SDD
converged: YES YES NO NO
title: Mulliken charges:
elementType: O O O C C C C C C C C C C C C H H H H H H H H H H H H H H H H H H H H H H H H
charge: -0.253805 -0.476836 -0.260652 -0.378274 -0.371959 -0.378336 -0.352625 -0.392343 -0.356582 -0.277147 0.189184 -0.695314 0.176270 -0.677201 -0.677325 0.195282 0.195566 0.191065 0.190919 0.196270 0.196409 0.188750 0.188665 0.214107 0.213993 0.195451 0.195438 0.229784 0.230366 0.209949 0.209956 0.216443 0.219874 0.225274 0.236134 0.219775 0.236622 0.224889 0.361963
chargesum: 0.00000
title: Mulliken charges with hydrogens summed into heavy atoms:
elementType: O O O C C C C C C C C C C C C
charge: -0.253805 -0.114873 -0.260652 0.012574 0.010024 0.014343 0.024791 0.035756 0.034307 0.183004 0.189184 -0.058966 0.176270 0.004082 0.003962
polarizability: 1.85807247e+02 8.76390988e-01 1.29985931e+02 1.77502969e-02 2.70161114e-02 1.13344037e+02
1716.lowfreq: -0.9740 -0.0004 0.0004 0.0012 3.9192 10.2171 20.6491 27.5544 33.7074
frequency: 20.2304 27.1752 33.6826 46.1219 51.8930 86.4140 88.9848 100.7992 127.1216 146.7830 152.6660 155.0480 176.5241 193.8508 230.2378 240.5680 241.1537 258.8525 316.1277 328.7685 330.2160 346.2912 382.1019 430.0853 438.4514 474.3432 523.7726 585.2478 718.4820 723.0649 731.0413 753.7265 783.8273 793.1712 859.6836 862.0660 888.4462 908.1982 930.4433 937.9149 941.9351 995.0344 1001.5749 1010.7468 1021.8747 1047.3220 1076.9185 1079.4682 1087.7781 1125.6305 1129.3653 1148.8971 1152.2447 1181.8575 1188.3416 1208.2846 1221.3062 1223.5025 1258.8231 1264.3236 1277.6838 1284.1302 1296.2313 1298.3489 1303.2579 1336.6194 1352.8512 1356.1937 1358.7669 1370.6163 1373.9185 1391.3692 1392.5953 1450.0419 1461.0967 1462.6035 1463.7590 1468.0426 1469.4591 1471.9064 1474.9394 1477.7728 1481.0226 1483.6501 1487.2792 1490.5105 1599.6420 2952.1536 2954.0611 2957.6835 2964.4864 2969.7265 2972.9203 2986.8055 2991.7671 2995.1708 2995.9601 2998.4011 3006.0589 3007.2014 3023.6081 3038.2746 3049.8326 3069.3896 3071.8060 3080.7124 3098.1622 3102.1582 3105.7293 3112.4160 3457.2186
redmass: 4.3479 4.5362 4.2509 1.9952 3.1075 1.7054 3.5505 2.8869 1.7930 2.3855 4.0069 1.9670 4.2551 1.0509 1.1294 1.4485 2.5626 2.1817 2.8770 3.7213 1.5710 4.3832 3.3525 1.9473 3.0725 3.2109 4.2472 3.7788 6.2864 1.0653 1.0805 1.1096 6.8127 1.1632 1.2085 4.1315 1.9607 4.3569 1.5015 1.1976 2.3873 4.5003 1.3071 1.1154 3.6281 3.2133 2.4525 2.2569 2.3277 2.8142 3.0936 1.4357 1.7280 3.8229 1.6874 3.1939 1.2858 1.3866 1.2470 1.2970 1.1125 1.0572 1.1150 1.0984 1.3222 1.3942 1.5192 1.6331 1.6302 1.2008 1.5288 1.2178 1.2601 1.0495 1.0460 1.0734 1.0738 1.0688 1.0821 1.0805 1.0785 1.0421 1.0803 1.0607 1.0883 1.0977 10.4023 1.0589 1.0589 1.0592 1.0592 1.0587 1.0365 1.0970 1.0598 1.0992 1.0340 1.0346 1.0567 1.1022 1.1041 1.1044 1.1044 1.1007 1.0993 1.1085 1.1010 1.1001 1.1013 1.1006 1.0650
irintensity: 0.6841 5.6310 0.4233 0.1953 0.2113 0.0422 0.2370 0.6245 1.3446 0.9044 0.4477 0.9920 0.9639 1.0127 0.0018 0.5910 2.0514 1.7971 7.5332 4.0595 102.0836 20.8631 16.2470 5.2536 0.4231 2.7382 0.3327 11.7702 6.9321 15.7051 0.1955 3.7263 1.1334 0.2934 0.4452 16.3804 3.6538 28.1107 0.4735 0.9068 53.9529 0.6972 0.0351 0.0476 4.1200 0.2263 0.3838 7.0863 38.6028 71.5074 176.3577 0.9997 290.9883 18.1427 0.6120 109.9874 13.5374 0.2853 0.0012 3.6473 0.2202 0.5499 0.1000 0.0663 1.5097 1.6767 11.7156 13.1053 2.9727 19.2754 19.1363 10.6745 11.0494 4.2828 3.6495 0.0183 0.0369 0.3824 0.0220 10.5932 4.2198 12.5442 0.9080 25.4952 1.9956 34.4476 178.5062 0.1186 1.4941 0.5552 15.5195 152.3255 36.2764 0.0481 21.4661 0.3918 20.7083 9.5150 32.9647 1.1303 0.0002 77.1673 52.4433 92.7006 53.7417 65.6706 17.4975 31.6536 1.0118 42.5252 39.3348
temp: 298.150 k
press: 1.00000 atm
elementType: 8 8 8 6 6 6 6 6 6 6 6 6 6 6 6 1 1 1 1 1 1 1 1 1 1 1 1 1 1 1 1 1 1 1 1 1 1 1 1
symmnumber: 1
zpe: 896510.3 jmol-1
zpe.correction: 0.341463 hartree
zpe.thermalcorrener: 0.361262 hartree
zpe.thermalcorrenthalpy: 0.362206 hartree
zpe.thermalcorrgfe: 0.290547 hartree
zpe.sumelectzpe: -696.106927 hartree
zpe.sumelectthermal: -696.087128 hartree
zpe.sumelectthermalent: -696.086184 hartree
zpe.sumelectthermalfe: -696.157843 hartree
dipole: -3.9947 -1.0434 0.0179
dipole: 4.1288
quadrupole: -117.5101 -96.6562 -91.7642
quadrupole: -6.5075 0.1088 -0.0209
quadrupole: -15.5333 5.3206 10.2126 -6.5075 0.1088 -0.0209
hfenergy: -696.4483899 hartree
pointgroup: C01 [X(C12H24O3)]
dipole: 1.5751631 -0.3968143 -0.006631 debye
polarizability: 185.8128203|-0.410866|129.9594167|0.6154664|0.508219|113.3649774 unknown
InChI: InChI=1S/C12H24O3/c1-4-5-6-7-8-9-10-15-11(13)12(2,3)14/h14H,4-10H2,1-3H3
charge 0 multiplicity 1
39 atoms
O  -2.150605 -0.152548 -0.04147
O  -5.796879 0.302678 -0.063361
O  -3.508251 1.738645 0.006273
C  2.853213 -0.314564 0.003039
C  4.18446 0.469868 0.018456
C  1.607487 0.599886 0.010055
C  5.430202 -0.444586 0.012691
C  0.283306 -0.200161 -0.014085
C  6.763451 0.337859 0.025393
C  -0.932986 0.723281 -0.001826
C  -4.562028 -0.492753 -0.084588
C  8.002106 -0.583935 0.019745
C  -3.371293 0.487537 -0.034259
C  -4.552036 -1.412596 1.158578
C  -4.525477 -1.307161 -1.39917
H  2.823215 -0.967784 -0.893782
H  2.816201 -0.991255 0.881997
H  4.214803 1.12455 0.914574
H  4.222394 1.145851 -0.861409
H  1.648178 1.279341 -0.866556
H  1.63552 1.248738 0.910042
H  5.395211 -1.119814 0.893323
H  5.40095 -1.100738 -0.882457
H  0.236903 -0.876523 0.860961
H  0.247012 -0.838361 -0.917823
H  6.792119 0.993422 0.919757
H  6.798045 1.012117 -0.854743
H  -0.963186 1.394154 -0.880095
H  -0.984391 1.343678 0.911794
H  8.01242 -1.227891 -0.879982
H  8.006278 -1.24704 0.905497
H  8.941797 -0.001626 0.029223
H  -3.660328 -2.061913 1.16648
H  -4.574564 -0.814424 2.085892
H  -5.460159 -2.038751 1.134258
H  -3.635058 -1.95705 -1.440367
H  -5.43514 -1.92969 -1.446761
H  -4.525659 -0.634864 -2.274616
H  -5.536733 1.265419 -0.032479
