program: Gaussian 09
title: 000249570
version: EM64L-G09RevD.01
frameworkgroup: C1[X(C15H14O)]
method: RPBEPBE
basis: SDD
operation: Freq
keyword: #pfreq=noraman
keyword: PBEPBE/SDD
title: #p freq=noraman PBEPBE/SDD
converged: YES YES NO NO
title: Mulliken charges:
elementType: O C C C C C C C C C C C C C C C H H H H H H H H H H H H H H
charge: -0.284254 0.311726 0.187302 -0.384100 -0.352584 -0.791603 0.488160 -0.235736 -0.218021 -0.345939 -0.397390 -0.396437 -0.132163 -0.237222 -0.230495 -0.250571 0.233513 0.256645 0.224151 0.249759 0.239985 0.228886 0.232170 0.243232 0.226849 0.216636 0.242574 0.224558 0.222636 0.227730
chargesum: 0.00000
title: Mulliken charges with hydrogens summed into heavy atoms:
elementType: O C C C C C C C C C C C C C C C
charge: -0.284254 0.311726 0.187302 -0.150587 -0.095939 -0.077707 0.488160 -0.006850 0.014149 -0.102707 -0.170541 -0.179800 0.110411 -0.012664 -0.007859 -0.022842
polarizability: 2.88370397e+02 -7.25206603e+00 1.25157544e+02 1.79627284e+01 7.25125692e+00 1.20102768e+02
1716.lowfreq: -7.2083 -0.0007 -0.0004 -0.0003 6.2517 6.7036 22.3436 28.7273 47.2038
frequency: 22.0773 28.6203 47.1718 87.5926 126.7837 140.8646 161.1709 207.4570 239.9593 266.4727 285.6664 314.4653 403.9341 420.4456 431.0382 459.5403 509.6002 517.8032 554.0055 579.2132 616.1624 628.6891 696.0537 718.1164 734.5998 762.5726 770.0832 811.2544 831.3290 846.5945 862.0106 868.9773 906.2974 943.7031 943.9353 971.2197 983.8508 984.4011 987.0914 990.8592 1026.4627 1036.6015 1044.7741 1057.4751 1088.4392 1108.8006 1168.0830 1171.3386 1175.1491 1192.6043 1217.1404 1234.2209 1277.4245 1290.4186 1314.5400 1332.7584 1373.7676 1381.1280 1403.6628 1429.1791 1439.6404 1465.0746 1472.3037 1480.3749 1486.2154 1580.1976 1585.7646 1611.1816 1613.2328 1663.9703 2984.4440 3063.0011 3094.6665 3110.0437 3117.2735 3120.3169 3122.4717 3124.2460 3136.0112 3139.3378 3145.2683 3156.5534 3163.7867 3172.0528
redmass: 3.6524 4.5543 4.9775 3.5675 2.0787 1.5514 2.3513 2.7487 4.8725 4.0603 4.3037 4.0029 2.7952 3.7500 4.0909 3.3103 3.2123 4.3684 5.7970 4.0458 6.4342 6.4922 1.6856 2.7352 4.3621 1.7233 1.5069 4.9583 1.6601 1.3940 1.7084 2.4785 1.4018 1.3761 1.1861 1.3917 1.3256 1.5850 6.1009 1.3196 2.2436 2.1239 1.5397 3.5918 1.8014 1.9768 1.1575 1.1040 1.9246 1.1167 2.0238 2.2180 1.5025 2.0041 1.2629 1.2819 7.2891 6.2383 1.2380 2.0956 2.3437 1.0929 1.6747 1.4946 2.3053 5.6944 6.0581 6.7030 6.2423 5.6938 1.0378 1.0959 1.1000 1.0954 1.0866 1.0874 1.0862 1.0871 1.0913 1.0893 1.0962 1.0945 1.1015 1.0999
irintensity: 0.0130 0.5854 0.0965 0.8161 0.0823 0.2279 2.4505 0.4534 2.6309 0.4129 2.5998 1.1561 0.0135 3.8196 3.1208 4.7505 12.5061 10.3797 0.9716 3.4155 0.1925 4.1636 45.6936 10.7525 25.3653 44.7104 75.9951 2.3579 3.8489 2.9235 1.5764 3.5701 2.8740 1.9693 77.5937 0.7148 0.1429 2.6027 1.5002 2.4069 19.9927 3.0321 12.7463 113.3486 15.3663 203.6923 32.0729 10.5264 201.0378 0.4083 7.3806 237.8205 0.5011 18.1947 8.7999 5.3936 1.5583 2.6326 8.5431 42.6855 8.5777 17.7811 22.0865 136.9381 6.1650 8.7600 31.6394 72.5059 1.4759 189.3005 19.4436 16.0196 22.2707 22.0145 1.0970 19.9582 12.3532 6.3635 8.3337 11.7478 51.0731 29.9030 27.5616 14.2966
temp: 298.150 k
press: 1.00000 atm
elementType: 8 6 6 6 6 6 6 6 6 6 6 6 6 6 6 6 1 1 1 1 1 1 1 1 1 1 1 1 1 1
symmnumber: 1
zpe: 634218.7 jmol-1
zpe.correction: 0.241561 hartree
zpe.thermalcorrener: 0.255875 hartree
zpe.thermalcorrenthalpy: 0.256819 hartree
zpe.thermalcorrgfe: 0.198286 hartree
zpe.sumelectzpe: -654.069775 hartree
zpe.sumelectthermal: -654.055461 hartree
zpe.sumelectthermalent: -654.054517 hartree
zpe.sumelectthermalfe: -654.113050 hartree
dipole: 0.9381 1.2655 0.7470
dipole: 1.7434
quadrupole: -82.7638 -92.4434 -91.8752
quadrupole: 1.3122 4.3364 0.8538
quadrupole: 6.2637 -3.4159 -2.8477 1.3122 4.3364 0.8538
hfenergy: -654.3113364 hartree
pointgroup: C01 [X(C15H14O1)]
dipole: 0.3844332 0.4897028 0.2878319 debye
polarizability: 287.3684031|-12.7474587|126.1182168|19.6747765|6.4047743|120.1440889 unknown
InChI: InChI=1S/C15H14O/c1-13-7-5-6-10-15(13)16-12-11-14-8-3-2-4-9-14/h2-12H,1H3
charge 0 multiplicity 1
30 atoms
O  1.112778 -1.051187 -0.629355
C  2.80158 0.744952 -0.406373
C  2.370307 -0.582025 -0.136903
C  4.088997 1.107815 0.066055
C  3.179499 -1.516533 0.539997
C  1.948911 1.715442 -1.202256
C  -2.561968 -0.217852 -0.173425
C  4.911115 0.191901 0.761382
C  4.459443 -1.127625 0.992837
C  -1.260185 -0.700627 -0.662334
C  -3.722213 -0.467132 -0.962919
C  -2.733221 0.490129 1.054038
C  -0.050392 -0.477915 -0.079983
C  -4.997182 -0.023792 -0.552963
C  -4.006268 0.934315 1.462093
C  -5.148056 0.682124 0.662603
H  4.453352 2.12324 -0.130777
H  2.797204 -2.529763 0.697549
H  2.54332 2.591168 -1.512702
H  1.536582 1.231838 -2.105746
H  1.083515 2.085669 -0.621341
H  5.901888 0.503376 1.109476
H  5.094232 -1.847397 1.520439
H  -1.264379 -1.293337 -1.58644
H  -3.614676 -1.013528 -1.908308
H  -1.869738 0.687429 1.699865
H  0.106075 0.102539 0.838553
H  -5.871835 -0.229252 -1.180544
H  -4.113668 1.475166 2.40952
H  -6.136517 1.027065 0.985162
