program: Gaussian 09
title: 000249565
version: EM64L-G09RevD.01
frameworkgroup: C1[X(C14H22ClNO2S)]
method: RPBEPBE
basis: SDD
operation: Freq
keyword: #p
keyword: freq=noraman
keyword: PBEPBE/SDD
title: #p freq=noraman PBEPBE/SDD
converged: NO YES NO NO
title: Mulliken charges:
elementType: Cl S O O N C C C C C C C C C C C C C C H H H H H H H H H H H H H H H H H H H H H H
charge: -0.011438 0.406841 -0.322446 -0.412812 0.028784 0.297262 0.348137 -0.204761 -0.057130 -0.553228 -0.530148 -0.482774 -0.817862 -0.785013 -0.788714 -0.242218 -0.090307 -0.659530 -0.340804 0.242651 0.224131 0.239381 0.229742 0.239336 0.208742 0.233118 0.204040 0.220736 0.209593 0.226950 0.215978 0.227739 0.216422 0.238099 0.213130 0.213934 0.225296 0.192274 0.270578 0.379711 0.346581
chargesum: 0.00000
title: Mulliken charges with hydrogens summed into heavy atoms:
elementType: Cl S O O N C C C C C C C C C C C C C C
charge: -0.011438 0.406841 -0.322446 -0.066231 0.028784 0.297262 0.348137 0.037889 0.167001 -0.084105 -0.082070 -0.045616 -0.160584 -0.124874 -0.123551 0.175352 0.180272 -0.279820 -0.340804
polarizability: 2.00368013e+02 1.06047117e+01 1.87277389e+02 -7.58646099e+00 -5.31597284e-01 1.61565514e+02
1716.lowfreq: -23.2690 -13.2982 -3.8235 0.0007 0.0013 0.0013 5.4272 20.3370 24.4948
frequency: -4.6099 17.4975 23.9236 40.2516 57.1758 83.5002 115.3739 121.2491 153.8931 177.5139 194.8647 197.9511 209.6599 212.9805 219.2562 223.8041 245.8798 254.7061 267.6972 310.4398 338.7632 362.5548 378.4722 392.0881 408.2989 414.0858 431.6484 446.8106 462.0140 504.1193 510.6660 534.6126 573.8810 582.2966 620.9943 638.5284 684.8462 707.5394 732.9814 777.0625 814.1193 829.1609 849.8171 880.7929 913.7216 928.7349 936.2648 938.6747 955.4427 959.9587 984.6452 995.7344 999.2773 1030.6638 1036.0047 1054.7640 1066.6922 1077.6969 1089.6573 1107.4098 1135.4387 1150.7472 1161.6263 1170.6183 1188.7383 1196.4644 1197.9119 1206.8653 1218.1874 1227.5503 1246.8449 1258.9699 1264.3465 1271.7272 1293.3347 1298.7125 1315.4335 1320.5462 1339.5755 1371.6849 1376.8753 1384.6115 1387.2061 1398.8121 1456.5877 1459.6063 1470.6998 1471.6358 1474.3421 1475.6898 1482.9882 1484.9180 1492.4241 1499.8347 2108.7055 2944.0716 2952.5457 2971.7403 2976.1362 2980.2567 3002.6987 3003.6348 3008.6059 3017.4375 3046.8270 3055.0404 3056.6816 3059.6924 3060.4803 3062.8296 3064.7277 3068.5014 3084.2461 3088.4109 3095.3164 3139.4260 3507.5580
redmass: 4.0929 7.6332 6.8348 9.3396 4.6475 5.8387 7.1957 2.1796 2.1754 1.8901 3.3945 1.4615 1.5472 2.4625 2.0804 2.8654 3.8730 2.7598 5.0595 2.1900 2.3055 3.3267 10.7310 3.1182 1.5820 1.6578 7.1518 2.6709 2.9182 4.1589 3.0594 4.2792 4.0289 3.3735 14.6344 3.4424 3.9351 6.3727 2.4836 2.4866 1.7648 2.1060 2.8893 2.3472 2.2736 1.7567 1.6048 1.6926 2.2459 2.0164 2.1172 1.9223 1.7792 1.8334 3.0029 2.6608 2.5708 1.2558 1.9188 1.5017 2.1825 2.1548 1.7894 1.1160 1.1432 1.8819 1.5616 1.6920 1.8474 1.9550 1.7085 1.3435 1.5149 1.9233 1.5402 1.5202 1.9722 1.3011 1.3026 1.1915 1.2280 1.2758 1.3012 1.1993 1.0712 1.0644 1.0574 1.0617 1.0570 1.0737 1.0544 1.0774 1.0649 1.0661 12.7377 1.0578 1.0837 1.0363 1.0374 1.0376 1.0640 1.0612 1.0985 1.0656 1.0897 1.1010 1.1019 1.0858 1.0984 1.0980 1.1018 1.0987 1.0971 1.1001 1.0968 1.0880 1.0654
irintensity: 0.0890 0.0781 0.6468 1.0693 0.6054 1.7342 5.0451 1.6458 1.0606 0.4888 1.4146 0.5922 2.4391 4.5245 1.0818 3.8226 1.5107 0.1780 2.2065 1.8315 0.3977 0.3972 3.8827 2.9375 53.5178 45.1300 3.2937 60.5920 33.5978 36.1819 16.4154 12.6182 2.8962 1.0140 5.6392 2.6650 63.1641 10.8233 2.5194 2.1205 8.7011 1.2579 19.0270 1.5088 2.2913 2.8387 3.3070 3.5369 4.1354 8.9008 2.2519 42.4015 28.5865 4.3433 71.2510 108.8932 15.2725 0.7164 64.2667 32.2315 17.1576 2.4063 0.7951 5.1957 4.3631 4.9826 17.8357 3.6047 4.8207 4.5557 1.7514 28.7395 1.0707 3.1423 0.3990 3.7020 5.6475 7.1549 17.4228 29.1388 14.9339 11.9686 3.1719 26.1183 0.5431 3.3715 7.6801 21.0612 0.5323 13.5596 1.3893 7.0191 16.4279 7.3538 21.0877 37.0207 40.1223 26.4076 23.2771 58.3837 20.8542 35.6348 35.0943 41.6239 42.3796 2.7523 17.8631 6.3151 44.4213 42.2865 55.0871 18.0797 30.1501 72.9223 21.9973 3.8047 14.0211
temp: 298.150 k
press: 1.00000 atm
elementType: 17 16 8 8 7 6 6 6 6 6 6 6 6 6 6 6 6 6 6 1 1 1 1 1 1 1 1 1 1 1 1 1 1 1 1 1 1 1 1 1 1
symmnumber: 1
zpe: 882761.7 jmol-1
zpe.correction: 0.336226 hartree
zpe.thermalcorrener: 0.356739 hartree
zpe.thermalcorrenthalpy: 0.357683 hartree
zpe.thermalcorrgfe: 0.286004 hartree
zpe.sumelectzpe: -1608.456116 hartree
zpe.sumelectthermal: -1608.435603 hartree
zpe.sumelectthermalent: -1608.434659 hartree
zpe.sumelectthermalfe: -1608.506338 hartree
dipole: -4.2733 -3.3256 0.3240
dipole: 5.4245
quadrupole: -139.6508 -141.0623 -130.0178
quadrupole: -10.6311 -0.2699 -4.0232
quadrupole: -2.7405 -4.1520 6.8925 -10.6311 -0.2699 -4.0232
hfenergy: -1608.792342 hartree
pointgroup: C01 [X(C14H22Cl1N1O2S1)]
dipole: 1.5962025 0.967484 -1.0348007 debye
polarizability: 199.864694|11.0854988|173.8275113|-5.2781815|-14.0349172|175.5187109 unknown
InChI: InChI=1S/C14H22ClNO2S/c1-13(2)9-4-5-14(13,3)11(6-9)18-7-10(17)12(15)19-8-16/h9-12,17H,4-7H2,1-3H3
charge 0 multiplicity 1
41 atoms
Cl -2.955403 1.728693 1.474079
S  -4.556013 -0.656056 0.249354
O  -0.150041 0.249647 -0.491539
O  -3.438448 1.51205 -1.682873
N  -4.468651 -2.218849 2.743146
C  2.026398 -0.237493 0.600709
C  3.522734 0.106355 0.188888
C  3.273281 -0.217418 -1.331257
C  1.241128 0.723381 -0.34615
C  1.850269 -1.679964 0.01518
C  2.065703 0.706033 -1.681041
C  2.731853 -1.676944 -1.284768
C  1.643463 -0.098941 2.076407
C  3.947356 1.571814 0.463099
C  4.576878 -0.802677 0.864784
C  -1.038312 1.238679 -1.096202
C  -2.451835 0.626168 -1.069093
C  -2.864911 0.201475 0.348184
C  -4.468787 -1.56864 1.736201
H  4.146533 -0.079872 -1.991987
H  1.196241 1.743265 0.092445
H  0.788985 -1.885024 -0.198626
H  2.194646 -2.434843 0.74452
H  2.387288 1.718684 -1.982103
H  1.46474 0.283834 -2.507423
H  3.554788 -2.410911 -1.222369
H  2.145873 -1.918718 -2.18955
H  2.223451 -0.796254 2.708497
H  1.820394 0.92769 2.449839
H  0.571665 -0.326199 2.223978
H  4.983756 1.737025 0.113069
H  3.310346 2.322421 -0.033932
H  3.929537 1.783889 1.548993
H  4.339019 -1.87649 0.796317
H  5.567756 -0.64778 0.396913
H  4.675353 -0.549904 1.937402
H  -0.768241 1.445964 -2.151798
H  -1.014061 2.19227 -0.524128
H  -2.45646 -0.280408 -1.699919
H  -2.13179 -0.468688 0.814826
H  -3.567879 2.298635 -1.087875
