program: Gaussian 09
title: 000249556
version: EM64L-G09RevD.01
frameworkgroup: C1[X(C12H21NO2)]
method: RPBEPBE
basis: SDD
operation: Freq
keyword: #p
keyword: freq=noraman
keyword: PBEPBE/SDD
title: #p freq=noraman PBEPBE/SDD
converged: YES YES NO NO
title: Mulliken charges:
elementType: O O N C C C C C C C C C C C C H H H H H H H H H H H H H H H H H H H H H
charge: -0.275961 -0.198925 -0.008629 0.260548 -0.094066 -0.463183 -0.366233 -0.735139 -0.730023 0.154913 -0.356254 -0.254308 -0.698994 -0.260196 -0.664164 0.237409 0.224148 0.225407 0.202102 0.225761 0.226216 0.216978 0.242008 0.213644 0.234007 0.242992 0.193895 0.198807 0.217633 0.217175 0.210405 0.224270 0.237773 0.222205 0.251716 0.226062
chargesum: 0.00000
title: Mulliken charges with hydrogens summed into heavy atoms:
elementType: O O N C C C C C C C C C C C C
charge: -0.275961 -0.198925 -0.008629 0.260548 0.143343 -0.013628 0.061630 -0.049937 -0.039380 0.154913 0.036448 -0.254308 -0.053780 0.201847 0.035819
polarizability: 1.43481344e+02 2.57676826e+00 1.43804594e+02 -3.20111199e+00 -5.45348726e+00 1.27598378e+02
1716.lowfreq: -11.4941 -0.0007 -0.0003 0.0003 6.4823 10.8521 39.2004 44.5308 60.2019
frequency: 39.1680 44.4242 59.9050 65.6672 73.3256 77.7972 93.2707 124.7573 127.2979 142.5888 170.9809 204.1449 211.5429 224.4870 234.9229 241.2261 247.1740 284.5123 312.6003 334.2820 372.9446 401.5049 409.8221 422.0977 459.6531 471.4571 597.4794 621.8811 697.9676 727.7800 740.8852 778.6156 809.6941 815.8412 865.0925 899.1598 899.9773 922.5902 954.3255 970.2331 977.1560 1008.1635 1016.0917 1054.6934 1082.1975 1091.3443 1100.9401 1103.2415 1118.2805 1153.5176 1158.1380 1176.7520 1197.7204 1237.9736 1266.2944 1279.3506 1286.3253 1299.5799 1315.0840 1322.6239 1335.2136 1354.9729 1359.9852 1385.7875 1390.4917 1392.2261 1405.1465 1454.8359 1457.5133 1462.9723 1465.8079 1468.4001 1474.2785 1476.3256 1479.0614 1483.6083 1486.1637 1487.5764 1492.9539 1634.7337 2194.5677 2962.6355 2972.1924 2974.9004 2980.8087 2984.0190 2993.4132 2999.6026 3004.4233 3010.1601 3030.2139 3031.5308 3066.8185 3072.3842 3074.2050 3074.5722 3077.0576 3081.7923 3086.9535 3088.2792 3094.0392 3120.1509
redmass: 3.8513 3.1284 2.0936 2.2990 3.0484 4.3209 3.5306 3.1299 4.1321 3.4896 4.1245 1.5498 1.6446 1.2693 1.2960 1.3920 1.4770 2.7586 2.8280 3.1337 3.6964 2.8687 5.4209 3.3776 3.3210 4.6199 4.3417 3.8826 5.2778 1.3226 2.2750 1.4449 1.7208 1.8411 2.8829 1.8151 1.6510 1.1790 1.4109 2.5005 1.8825 3.4098 2.7572 3.3757 2.4329 2.4720 2.5375 1.9947 2.2659 2.1201 2.0407 2.0304 2.1488 1.6916 1.2986 1.1160 1.2226 1.0847 1.3683 1.3616 1.3649 1.2750 1.5271 1.2098 1.2279 1.2139 1.2007 1.0751 1.0911 1.0467 1.0744 1.0528 1.0468 1.0642 1.0426 1.0519 1.0532 1.0779 1.0447 10.3576 12.6422 1.0588 1.0594 1.0367 1.0356 1.0364 1.0360 1.0598 1.0978 1.0845 1.0610 1.1014 1.1035 1.1012 1.0997 1.0997 1.0994 1.0988 1.0990 1.0975 1.1028 1.1063
irintensity: 0.8259 0.2265 0.0173 0.0167 0.1765 2.2719 0.4050 0.4096 1.8535 1.6942 2.7936 2.1671 0.2083 0.0818 0.3167 0.0277 0.2232 0.3206 9.7012 1.1264 1.2100 2.2293 4.9972 2.5636 0.6274 2.2602 4.1950 4.9624 4.7626 7.0657 4.9682 3.5179 1.7323 4.6853 0.6804 5.6291 2.4780 3.4847 3.2012 8.0669 8.4223 0.8709 77.0085 6.5003 12.9383 131.5230 65.0136 89.4953 6.6161 28.5448 7.4660 9.3279 28.0988 15.7668 3.4426 3.9964 5.6192 1.9133 0.8244 0.3989 4.5076 0.7819 1.8564 11.0257 30.9250 13.0415 22.6937 2.6096 12.9053 14.6618 0.1886 0.8276 6.7636 3.0333 12.6511 7.1423 14.4422 16.2901 15.0237 135.6490 4.0789 13.4938 32.8448 39.8216 25.8807 14.5656 15.9427 28.1271 3.6460 6.6158 22.2774 20.4257 1.9530 75.1068 9.3103 50.5477 53.2443 54.7619 32.2577 31.8257 1.0960 28.1669
temp: 298.150 k
press: 1.00000 atm
elementType: 8 8 7 6 6 6 6 6 6 6 6 6 6 6 6 1 1 1 1 1 1 1 1 1 1 1 1 1 1 1 1 1 1 1 1 1
symmnumber: 1
zpe: 809401.2 jmol-1
zpe.correction: 0.308285 hartree
zpe.thermalcorrener: 0.327175 hartree
zpe.thermalcorrenthalpy: 0.328119 hartree
zpe.thermalcorrgfe: 0.260743 hartree
zpe.sumelectzpe: -673.862491 hartree
zpe.sumelectthermal: -673.843600 hartree
zpe.sumelectthermalent: -673.842656 hartree
zpe.sumelectthermalfe: -673.910032 hartree
dipole: 0.9943 2.6931 -5.0394
dipole: 5.7997
quadrupole: -85.7853 -89.7201 -104.9748
quadrupole: 1.3854 -0.9510 6.1281
quadrupole: 7.7081 3.7733 -11.4814 1.3854 -0.9510 6.1281
hfenergy: -674.1707752 hartree
pointgroup: C01 [X(C12H21N1O2)]
dipole: -0.0083306 1.4328017 -1.7758298 debye
polarizability: 141.9966723|2.2772435|146.4018897|-2.8875045|-3.0819555|126.4857545 unknown
InChI: InChI=1S/C12H21NO2/c1-5-7-8-12(9-13,10(3)4)11(14)15-6-2/h10H,5-8H2,1-4H3
charge 0 multiplicity 1
36 atoms
O  0.601148 1.779479 -0.508691
O  0.815007 0.975195 1.668787
N  0.299336 -2.544254 1.60444
C  0.292186 -0.588375 -0.216359
C  1.411395 -0.899915 -1.302383
C  -1.137296 -0.519526 -0.868432
C  -2.26115 -0.084957 0.09665
C  1.171008 -2.246292 -2.02209
C  2.826845 -0.865125 -0.679959
C  0.603891 0.771761 0.455632
C  -3.651671 -0.122395 -0.577606
C  0.302777 -1.644675 0.822014
C  -4.785197 0.320745 0.371826
C  0.890157 3.167772 -0.022196
C  2.398335 3.415575 0.057943
H  1.327419 -0.077482 -2.039011
H  -1.377861 -1.519177 -1.274816
H  -1.075457 0.184838 -1.719268
H  -2.066508 0.941437 0.468595
H  -2.268496 -0.746214 0.986052
H  0.218236 -2.2658 -2.578991
H  1.983298 -2.424081 -2.750154
H  1.172679 -3.088584 -1.305706
H  3.586283 -1.048332 -1.46132
H  3.053394 0.111061 -0.214049
H  2.941048 -1.646291 0.094033
H  -3.642847 0.528717 -1.475948
H  -3.853237 -1.15135 -0.939473
H  -4.833854 -0.333549 1.262309
H  -5.769606 0.283577 -0.129516
H  -4.624775 1.35641 0.726265
H  0.402363 3.807123 -0.774953
H  0.407793 3.297933 0.962523
H  2.585442 4.472681 0.323176
H  2.861528 2.782354 0.833038
H  2.884286 3.213311 -0.912263
