program: Gaussian 09
title: 000249555
version: EM64L-G09RevD.01
frameworkgroup: C1[X(C12H18O6)]
method: RPBEPBE
basis: SDD
operation: Freq
keyword: #pfreq=noraman
keyword: PBEPBE/SDD
title: #p freq=noraman PBEPBE/SDD
converged: YES YES NO NO
title: Mulliken charges:
elementType: O O O O O O C C C C C C C C C C C C H H H H H H H H H H H H H H H H H H
charge: -0.253895 -0.253968 -0.267060 -0.267031 -0.214308 -0.214318 -0.481926 -0.482082 -0.492896 -0.492325 -0.291553 -0.291600 0.281540 0.281569 0.235954 0.235643 -0.767792 -0.767615 0.244606 0.260456 0.244899 0.260299 0.233242 0.293468 0.233300 0.293220 0.229123 0.254842 0.229119 0.254855 0.238587 0.239635 0.257987 0.238408 0.239666 0.257953
chargesum: 0.00000
title: Mulliken charges with hydrogens summed into heavy atoms:
elementType: O O O O O O C C C C C C C C C C C C
charge: -0.253895 -0.253968 -0.267060 -0.267031 -0.214308 -0.214318 0.023136 0.023115 0.033814 0.034195 0.192412 0.192374 0.281540 0.281569 0.235954 0.235643 -0.031583 -0.031588
polarizability: 1.61145831e+02 -2.47334645e-02 1.63515089e+02 -2.06470147e+00 2.74913953e-04 1.17093284e+02
1716.lowfreq: -0.0008 -0.0007 0.0004 7.2014 8.1337 14.7635 19.1648 24.3888 27.9991
frequency: 18.2475 24.0771 27.9432 31.6905 32.1057 60.1018 74.9902 77.3740 81.0938 96.5900 98.5887 101.6460 102.3283 141.7343 152.4226 226.6593 229.8568 247.5092 258.7710 329.2911 340.9174 380.6510 404.8933 408.4664 463.1793 466.9672 478.8629 546.9323 552.6788 616.3660 636.1230 679.6206 688.3684 721.0797 740.7316 762.0263 793.3645 845.7805 850.6502 901.6697 910.3574 915.7186 919.9510 958.0139 959.8074 1008.4552 1030.3113 1042.2103 1047.9282 1056.9679 1060.3142 1089.3170 1121.7303 1131.7113 1175.7193 1176.1437 1191.2635 1206.0527 1228.6750 1268.5660 1268.8831 1280.5768 1293.7546 1297.4335 1348.8537 1356.0648 1356.5545 1364.6618 1369.1825 1369.2298 1430.5280 1431.4784 1431.8679 1437.2878 1444.2158 1444.5711 1451.4851 1451.6122 1457.1027 1457.2409 1629.9560 1631.2317 1640.5531 1641.6813 2979.9210 2980.0227 2985.4654 2985.5936 3028.8883 3029.2067 3029.5946 3031.2303 3038.7135 3038.7757 3070.3288 3070.3773 3106.1660 3107.6996 3118.1837 3118.2237 3122.3140 3122.4557
redmass: 4.2683 3.4494 4.4044 5.2477 4.9472 3.9581 1.2961 1.2544 9.3125 2.4969 3.0969 2.1768 3.1367 4.1572 5.1569 8.3840 8.1128 4.6907 2.9950 2.4950 3.2167 3.2981 3.0610 3.1565 2.0912 2.0123 2.2450 4.5158 4.8437 3.7377 4.2651 4.6755 7.0970 2.6427 1.4729 1.6158 3.5714 3.8766 3.7228 2.9256 3.3105 1.4865 1.5996 2.0384 2.0935 2.7129 2.6606 1.9955 2.0154 3.3991 3.2538 3.1041 2.1753 1.8857 2.1568 2.1359 1.5462 1.7628 1.1315 1.3537 1.3597 1.1403 1.3078 1.3843 1.4485 1.6739 1.4864 1.3755 1.2308 1.2371 1.0812 1.0863 1.0784 1.1024 1.0730 1.0684 1.0990 1.0968 1.0586 1.0595 8.0878 8.9084 8.2624 8.6635 1.0491 1.0487 1.0500 1.0502 1.0575 1.0912 1.0905 1.0611 1.0667 1.0671 1.0946 1.0945 1.1076 1.1059 1.1013 1.1013 1.1008 1.1007
irintensity: 0.0083 5.2349 1.8331 3.0722 4.6386 4.9054 0.1742 0.1901 0.3411 0.8612 2.3015 2.1037 3.4762 1.6439 10.3811 1.2393 1.0194 23.0664 8.7095 8.3699 0.4976 8.5527 14.6886 0.1113 2.3952 0.0971 5.9373 20.1556 16.6385 6.2635 0.2257 1.2256 8.8091 1.7483 1.4828 5.6999 11.8920 2.1396 4.4697 11.8123 58.4662 8.6997 2.9777 7.1525 2.0941 15.7102 21.7536 18.0609 103.2408 0.8651 2.2107 0.6570 26.4155 152.6838 37.2745 30.7297 22.8129 175.6729 2.6103 83.6926 76.3680 8.7349 84.9954 204.8103 56.4597 2.3393 5.5325 1.9990 37.1796 79.6850 55.3833 0.0242 17.6956 38.2922 55.5506 0.3589 64.7661 7.6258 34.8259 8.5664 417.5420 39.9951 27.6756 119.2876 6.1466 1.3602 17.6439 13.7279 7.3726 2.8355 13.7900 46.3594 4.0724 5.7365 9.5679 14.0740 5.6023 16.5350 7.0571 5.1242 18.3685 8.7902
temp: 298.150 k
press: 1.00000 atm
elementType: 8 8 8 8 8 8 6 6 6 6 6 6 6 6 6 6 6 6 1 1 1 1 1 1 1 1 1 1 1 1 1 1 1 1 1 1
symmnumber: 1
zpe: 750302.2 jmol-1
zpe.correction: 0.285775 hartree
zpe.thermalcorrener: 0.307086 hartree
zpe.thermalcorrenthalpy: 0.308030 hartree
zpe.thermalcorrgfe: 0.230402 hartree
zpe.sumelectzpe: -918.018814 hartree
zpe.sumelectthermal: -917.997502 hartree
zpe.sumelectthermalent: -917.996558 hartree
zpe.sumelectthermalfe: -918.074187 hartree
dipole: -0.0004 0.8254 0.0133
dipole: 0.8255
quadrupole: -143.4399 -84.1673 -106.7802
quadrupole: 0.0565 6.9948 -0.0216
quadrupole: -31.9774 27.2952 4.6823 0.0565 6.9948 -0.0216
hfenergy: -918.3045885 hartree
pointgroup: C01 [X(C12H18O6)]
dipole: -0.000095 -0.3247542 0.0026515 debye
polarizability: 161.1747489|-0.0364628|163.5122038|1.727887|0.3687169|117.0672511 unknown
InChI: InChI=1S/C12H18O6/c1-9(13)3-5-11(15)17-7-8-18-12(16)6-4-10(2)14/h3-8H2,1-2H3
charge 0 multiplicity 1
36 atoms
O  1.505958 -2.422494 0.641735
O  -1.51073 -2.41136 -0.682815
O  0.206757 -0.792602 1.698209
O  -0.209652 -0.76597 -1.712509
O  4.57109 1.4675 0.173504
O  -4.566151 1.484092 -0.158637
C  2.516038 -0.276228 0.98702
C  -2.518048 -0.258214 -0.992147
C  2.238319 0.793931 -0.095398
C  -2.237121 0.795853 0.105192
C  0.367272 -3.380329 0.642105
C  -0.372703 -3.36992 -0.698055
C  1.291006 -1.144955 1.17543
C  -1.294255 -1.125372 -1.195327
C  3.457111 1.6734 -0.377649
C  -3.453275 1.674787 0.400155
C  3.243738 2.825019 -1.354219
C  -3.23856 2.80609 1.399982
H  2.757764 0.221777 1.942235
H  3.379836 -0.89174 0.694765
H  -2.761216 0.253948 -1.939482
H  -3.381842 -0.877161 -0.707269
H  1.391388 1.443685 0.205713
H  1.910605 0.31557 -1.04018
H  -1.388644 1.447465 -0.187518
H  -1.910048 0.303448 1.042868
H  0.843757 -4.361181 0.803931
H  -0.322879 -3.14478 1.471614
H  -0.84995 -4.347832 -0.874682
H  0.317473 -3.122307 -1.524024
H  2.719742 3.652916 -0.837042
H  2.611176 2.520917 -2.20711
H  4.213037 3.202009 -1.716011
H  -2.698362 3.637161 0.905128
H  -2.619971 2.478478 2.254483
H  -4.207762 3.187297 1.757507
