program: Gaussian 09
title: 000249552
version: EM64L-G09RevD.01
frameworkgroup: C1[X(C11H20O7)]
method: RPBEPBE
basis: SDD
operation: Freq
keyword: #pfreq=noraman
keyword: PBEPBE/SDD
title: #p freq=noraman PBEPBE/SDD
converged: YES YES NO NO
title: Mulliken charges:
elementType: O O O O O O O C C C C C C C C C C C H H H H H H H H H H H H H H H H H H H H
charge: -0.284386 -0.253194 -0.471772 -0.460627 -0.432550 -0.255647 -0.231384 -0.007910 0.182022 -0.367534 0.147149 -0.366148 0.202184 0.289696 -0.683878 -0.672799 -0.705690 -0.696309 0.263353 0.285246 0.238319 0.211762 0.254715 0.209049 0.241882 0.229840 0.247389 0.231024 0.216089 0.232844 0.203172 0.252918 0.210092 0.219979 0.263210 0.361647 0.344359 0.351890
chargesum: 0.00000
title: Mulliken charges with hydrogens summed into heavy atoms:
elementType: O O O O O O O C C C C C C C C C C C
charge: -0.284386 -0.253194 -0.110125 -0.116268 -0.080661 -0.255647 -0.231384 0.255443 0.182022 0.156031 0.147149 0.100329 0.202184 0.289696 -0.003107 0.021703 -0.016757 -0.003028
polarizability: 1.50949314e+02 -4.44242512e+00 1.44532907e+02 -3.45486390e+00 -3.87423354e+00 1.29072978e+02
1716.lowfreq: -16.5275 -1.8054 -0.0007 -0.0006 -0.0003 8.3237 9.5367 19.6129 28.6159
frequency: -10.4592 19.4838 28.3604 38.5532 57.9052 64.4638 80.0476 107.7514 133.8628 153.6065 158.8993 177.7592 199.4729 202.2792 212.7357 230.0989 246.7767 254.2635 258.3257 288.2918 292.8490 300.3562 319.5013 336.6880 348.5785 353.0168 380.0402 389.6311 398.5731 422.4627 435.8921 484.0400 492.4372 572.9287 587.4296 650.9006 712.0095 719.8400 745.1282 778.7122 790.4796 822.2349 868.4479 885.4049 906.5120 919.4760 930.2345 936.7987 942.5137 994.9774 995.7035 1001.7965 1017.8734 1044.4689 1079.9713 1109.8331 1118.5606 1132.2249 1147.9261 1173.7622 1177.9002 1200.7810 1208.3277 1210.5673 1224.3624 1284.5067 1322.4656 1335.9138 1342.1694 1352.4095 1357.5716 1371.5814 1377.6618 1387.6230 1392.6691 1398.1638 1450.1867 1451.8838 1453.3086 1458.1103 1459.5412 1465.1906 1466.4124 1474.2413 1481.0746 1481.8135 1606.0099 1644.3299 2984.6744 2990.9227 2995.3639 2998.0923 3009.0569 3031.8049 3042.1331 3074.1950 3087.4586 3091.1279 3100.4048 3101.3242 3107.8105 3108.5583 3109.9463 3110.4851 3118.0821 3474.4029 3548.9448 3559.8368
redmass: 3.9372 4.2888 3.5412 5.6797 7.7772 5.2195 7.5672 4.3756 3.8300 3.2897 2.4818 1.2540 1.1917 1.0373 1.8450 2.2507 1.3282 1.7676 1.5267 1.7515 4.3171 4.2165 3.0460 2.7422 3.3051 3.8111 3.1551 2.6498 1.2818 2.4589 3.7936 3.4840 3.9633 3.1716 3.7608 4.7690 8.1628 6.6613 5.6753 4.5742 5.4402 3.4404 3.5038 3.2604 1.8977 1.5939 1.5855 2.0824 2.2371 1.3686 3.8274 1.3047 2.6836 2.2746 1.6644 3.1578 1.8681 2.7065 1.6501 2.2002 3.5841 1.8217 2.1538 3.4368 1.2733 1.4573 1.2962 1.7407 1.2181 1.6005 1.4288 1.1989 1.2246 1.2879 1.2073 1.2126 1.0494 1.0520 1.0870 1.0526 1.0483 1.0837 1.0472 1.0775 1.0736 1.0759 10.8166 10.3464 1.0370 1.0377 1.0342 1.0346 1.0638 1.0728 1.0682 1.0992 1.0977 1.1030 1.1011 1.1011 1.1007 1.1008 1.0999 1.1078 1.0991 1.0651 1.0660 1.0658
irintensity: 0.0787 2.0334 1.2654 2.3511 3.2674 0.2864 2.8139 9.2805 1.2658 2.5415 35.5619 82.1789 0.7877 7.9931 18.5804 4.8135 4.2170 13.4258 1.4212 67.4812 19.1261 10.1460 12.3622 3.7278 3.3973 33.5630 11.4972 8.4622 133.3491 2.4641 30.7128 4.1689 6.9095 7.1703 13.9397 7.2595 16.8130 10.3867 19.7303 2.9945 8.5726 21.3758 0.7009 27.1799 9.5218 5.5443 6.1334 10.5216 36.0268 1.4974 104.8309 0.0652 9.9001 38.0870 138.3230 267.7906 51.9886 245.7033 215.3852 17.2298 23.6634 3.4955 68.4638 31.8755 19.7221 6.2094 11.5070 12.3068 17.6171 34.2969 3.6259 19.6989 20.0257 6.3579 11.2516 24.8072 2.5362 4.0003 28.0322 0.9356 10.3750 3.6303 8.1463 11.0586 27.2018 42.5079 147.7940 163.9588 12.9895 28.1660 13.8589 11.3311 16.5483 2.7226 24.8906 13.3686 34.8810 18.3421 7.2921 12.4525 33.3777 33.2686 15.1203 4.8676 13.5070 28.9720 8.2186 7.6436
temp: 298.150 k
press: 1.00000 atm
elementType: 8 8 8 8 8 8 8 6 6 6 6 6 6 6 6 6 6 6 1 1 1 1 1 1 1 1 1 1 1 1 1 1 1 1 1 1 1 1
symmnumber: 1
zpe: 801106.5 jmol-1
zpe.correction: 0.305125 hartree
zpe.thermalcorrener: 0.326578 hartree
zpe.thermalcorrenthalpy: 0.327523 hartree
zpe.thermalcorrgfe: 0.254217 hartree
zpe.sumelectzpe: -956.269193 hartree
zpe.sumelectthermal: -956.247740 hartree
zpe.sumelectthermalent: -956.246796 hartree
zpe.sumelectthermalfe: -956.320101 hartree
dipole: -5.2383 0.0815 0.9465
dipole: 5.3238
quadrupole: -103.2473 -117.9946 -104.2674
quadrupole: 6.0398 0.4023 -10.5252
quadrupole: 5.2558 -9.4915 4.2357 6.0398 0.4023 -10.5252
hfenergy: -956.5743185 hartree
pointgroup: C01 [X(C11H20O7)]
dipole: 1.946724 -0.3006485 0.7119969 debye
polarizability: 147.4901092|-2.8949249|146.206598|7.6217525|-4.5859671|130.8584919 unknown
InChI: InChI=1S/C11H20O7/c1-10(2,15)8(13)17-6-7(5-12)18-9(14)11(3,4)16/h7,12,15-16H,5-6H2,1-4H3
charge 0 multiplicity 1
38 atoms
O  -1.551065 -0.38623 0.434688
O  1.268406 -1.556977 0.126215
O  -3.286785 2.191205 -1.534239
O  2.197442 0.093922 2.140753
O  -2.259346 -2.244176 2.479493
O  -2.440397 -0.378026 -1.717718
O  1.320576 0.434017 -1.088125
C  -1.184982 -1.839313 0.290105
C  -2.529375 1.695506 -0.376892
C  0.051576 -2.008669 -0.598318
C  2.886752 0.092583 0.818929
C  -1.002009 -2.324734 1.734573
C  -2.183813 0.216923 -0.640799
C  1.751683 -0.282161 -0.160252
C  -3.439321 1.83604 0.864009
C  -1.224954 2.517218 -0.228366
C  3.419208 1.497673 0.489073
C  4.001634 -0.976922 0.806201
H  -2.040267 -2.351759 -0.190479
H  -0.05288 -1.456636 -1.546971
H  0.219435 -3.080376 -0.797195
H  -0.731117 -3.393764 1.730899
H  -0.191601 -1.74831 2.220438
H  -2.906122 1.542632 1.784308
H  -3.745717 2.892518 0.947597
H  -4.35144 1.224755 0.753692
H  -0.565299 2.374058 -1.100396
H  -1.501114 3.583492 -0.163529
H  -0.670823 2.223845 0.680011
H  3.846176 1.533779 -0.527627
H  4.212822 1.777338 1.20749
H  2.606839 2.240928 0.541733
H  4.802251 -0.69106 1.513811
H  4.455022 -1.07352 -0.197161
H  3.589721 -1.953445 1.105248
H  -3.226319 1.509083 -2.258359
H  2.829093 0.464506 2.810061
H  -2.51809 -1.288741 2.534693
