program: Gaussian 09
title: 000249546
version: EM64L-G09RevD.01
frameworkgroup: C1[X(C11H15NO)]
method: RPBEPBE
basis: SDD
operation: Freq
keyword: #p
keyword: freq=noraman
keyword: PBEPBE/SDD
title: #p freq=noraman PBEPBE/SDD
converged: YES YES NO NO
title: Mulliken charges:
elementType: O N C C C C C C C C C C C H H H H H H H H H H H H H H H
charge: -0.247634 -0.105322 -0.339825 -0.340553 -0.485417 -0.321645 -0.318134 0.449993 -0.447996 -0.375362 -0.219833 -0.226752 -0.245327 0.194400 0.230283 0.209610 0.189696 0.194803 0.220045 0.192969 0.214869 0.213292 0.191469 0.232493 0.263030 0.224694 0.224726 0.227425
chargesum: 0.00000
title: Mulliken charges with hydrogens summed into heavy atoms:
elementType: O N C C C C C C C C C C C
charge: -0.247634 -0.105322 0.084859 0.058753 -0.070569 0.086193 0.086628 0.449993 -0.215503 -0.112331 0.004860 -0.002026 -0.017901
polarizability: 1.55544403e+02 -1.12638844e+01 1.11091733e+02 1.21399016e+01 1.20827573e+01 9.91577552e+01
1716.lowfreq: -26.0100 -10.5782 -0.0004 -0.0002 0.0003 9.3944 30.6103 50.4140 66.6778
frequency: 29.6586 50.2711 66.5485 157.3832 205.5796 234.8518 280.3314 298.1670 323.2727 392.6355 406.7773 442.3251 465.0198 484.5688 588.9339 604.8558 617.5491 704.9714 738.4553 775.0420 803.4302 811.4509 839.8114 860.1122 896.6995 918.1484 982.2498 986.4081 990.4530 997.6532 1002.7572 1025.5128 1028.1253 1052.3981 1076.5947 1083.3853 1105.2939 1127.2189 1147.1641 1169.9529 1180.9882 1187.9931 1211.1461 1219.3075 1261.2002 1275.0165 1292.4330 1310.9076 1330.6033 1338.8665 1356.8247 1367.9805 1375.4031 1392.5656 1439.7121 1441.2608 1446.4426 1450.2806 1457.5585 1469.0871 1482.8292 1594.1999 1614.4446 2845.7828 2858.6038 2870.5658 2952.0342 2956.3565 2986.0252 3020.1292 3040.8918 3079.6724 3084.2601 3113.1844 3122.5536 3135.8445 3147.2429 3161.4181
redmass: 3.7565 3.2858 4.6434 3.4520 3.6855 2.0042 4.0000 2.9390 2.0866 1.8679 2.8478 4.0776 2.8299 3.6960 3.3923 2.4726 5.4322 2.1828 1.6443 3.1219 3.6847 3.8537 1.6157 1.2476 2.1864 1.4042 1.4249 1.8102 5.0381 2.1545 1.6199 2.1394 2.1520 1.9721 1.6902 3.3750 2.1223 2.5997 2.6693 1.0596 1.1111 1.0693 2.3087 1.2344 1.3338 1.3998 1.2744 1.3758 1.2660 1.2541 1.4537 1.2823 2.4711 2.4316 2.0105 1.0833 1.0869 1.1030 1.1227 1.1432 2.1214 6.1477 6.1302 1.0707 1.0705 1.0688 1.0666 1.0667 1.0865 1.0896 1.0893 1.0962 1.0974 1.0868 1.0863 1.0915 1.0955 1.1014
irintensity: 0.3104 0.0747 0.2264 5.2004 2.6284 1.4692 2.6219 7.9627 6.4374 0.5191 0.3333 2.0393 2.1816 13.4155 3.5749 3.0993 0.2259 33.7754 50.2928 18.4696 25.4594 12.4371 0.3362 0.1893 14.3317 5.1265 0.6085 1.0643 0.3003 30.0990 4.1878 9.3484 7.8762 23.1932 13.6281 52.5488 0.7650 49.7821 2.3620 0.3848 1.2137 1.7475 3.8416 4.3059 15.0697 16.3453 2.0541 23.1731 2.9547 10.8073 1.7939 2.7367 0.3978 5.6935 16.2890 2.3794 1.0575 14.6484 4.5257 14.1507 10.5018 0.8502 5.5878 40.9552 55.8983 162.4664 34.5149 97.6160 20.8115 50.0982 26.4707 43.4606 35.3412 8.4447 0.2754 20.1505 32.9602 24.8737
temp: 298.150 k
press: 1.00000 atm
elementType: 8 7 6 6 6 6 6 6 6 6 6 6 6 1 1 1 1 1 1 1 1 1 1 1 1 1 1 1
symmnumber: 1
zpe: 625907.9 jmol-1
zpe.correction: 0.238396 hartree
zpe.thermalcorrener: 0.249868 hartree
zpe.thermalcorrenthalpy: 0.250812 hartree
zpe.thermalcorrgfe: 0.199768 hartree
zpe.sumelectzpe: -557.128379 hartree
zpe.sumelectthermal: -557.116907 hartree
zpe.sumelectthermalent: -557.115963 hartree
zpe.sumelectthermalfe: -557.167007 hartree
dipole: 1.2885 0.8430 -0.3246
dipole: 1.5736
quadrupole: -84.2887 -73.8317 -76.4958
quadrupole: -4.9186 6.2214 1.6949
quadrupole: -6.0833 4.3737 1.7096 -4.9186 6.2214 1.6949
hfenergy: -557.3667752 hartree
pointgroup: C01 [X(C11H15N1O1)]
dipole: -0.499572 -0.2351913 0.2800227 debye
polarizability: 154.5800751|-18.264808|93.4881189|2.5935592|4.0717453|117.7256971 unknown
InChI: InChI=1S/C11H15NO/c1-2-4-11(5-3-1)10-12-6-8-13-9-7-12/h1-5H,6-10H2
charge 0 multiplicity 1
28 atoms
O  3.823228 0.525755 -0.661724
N  1.216878 -0.435144 0.186506
C  1.478863 1.015312 -0.000627
C  2.461822 -1.141362 0.579312
C  0.095755 -0.698415 1.119187
C  2.581339 1.217128 -1.051127
C  3.551125 -0.909906 -0.481123
C  -1.260245 -0.278053 0.559118
C  -2.231457 0.323393 1.396253
C  -1.584857 -0.523277 -0.799684
C  -3.507978 0.665451 0.892058
C  -2.856619 -0.178952 -1.3074
C  -3.825061 0.41437 -0.462388
H  1.793707 1.496007 0.960406
H  0.548659 1.507466 -0.338707
H  2.251071 -2.225256 0.660764
H  2.842637 -0.788419 1.571507
H  0.252737 -0.205045 2.112877
H  0.086174 -1.791243 1.309919
H  2.232205 0.833081 -2.034038
H  2.854195 2.281198 -1.143744
H  4.510589 -1.355098 -0.169449
H  3.228805 -1.354304 -1.447836
H  -1.988367 0.528027 2.446743
H  -0.821479 -0.971495 -1.44551
H  -4.2490 1.131038 1.551925
H  -3.094921 -0.373033 -2.359685
H  -4.812307 0.681179 -0.856333
