program: Gaussian 09
title: 000249545
version: EM64L-G09RevD.01
frameworkgroup: C1[X(C11H11Cl3O2)]
method: RPBEPBE
basis: SDD
operation: Freq
keyword: #p
keyword: freq=noraman
keyword: PBEPBE/SDD
title: #p freq=noraman PBEPBE/SDD
converged: NO YES NO NO
title: Mulliken charges:
elementType: Cl Cl Cl O O C C C C C C C C C C C H H H H H H H H H H H
charge: 0.106987 0.086870 0.108069 -0.300472 -0.261376 0.433418 -0.667109 -0.685832 -0.686354 0.238985 0.203719 -0.340162 -0.332070 -0.218891 -0.216999 -0.220156 0.270888 0.236299 0.243476 0.243437 0.270619 0.236649 0.268590 0.278459 0.234875 0.234091 0.233989
chargesum: 0.00000
title: Mulliken charges with hydrogens summed into heavy atoms:
elementType: Cl Cl Cl O O C C C C C C C C C C C
charge: 0.106987 0.086870 0.108069 -0.300472 -0.261376 0.433418 -0.667109 0.064831 0.064351 0.238985 0.203719 -0.071571 -0.053611 0.015984 0.017092 0.013833
polarizability: 2.04888985e+02 -1.76499559e+01 1.53370833e+02 2.07557264e-01 2.42876145e-01 1.03868612e+02
1716.lowfreq: -11.3850 -7.3414 -6.6962 0.0010 0.0030 0.0036 23.6240 37.4551 57.3985
frequency: 22.7922 37.4431 57.3872 75.4624 89.5945 151.8115 164.5998 191.8408 195.5939 199.7956 206.4752 249.4721 265.5885 277.2946 290.4238 320.4238 323.0584 366.3292 402.7339 417.8922 426.9411 462.1692 483.2920 532.5476 613.2377 671.8525 677.3378 700.3465 713.9260 731.6955 749.2190 795.8169 829.7473 864.4140 874.1323 941.1438 953.2414 955.5428 990.0327 996.5012 1006.7857 1009.6711 1019.0132 1051.0905 1087.6714 1151.8920 1174.7260 1185.0651 1196.8961 1207.2955 1248.6525 1316.1491 1377.8426 1390.1098 1395.7500 1438.2875 1456.0635 1468.6503 1473.7100 1476.8931 1489.2212 1584.4629 1610.1072 1621.6881 3014.9212 3017.6842 3116.8160 3120.3986 3128.3194 3131.4541 3132.0445 3144.0928 3156.3549 3168.1117 3181.3568
redmass: 8.6314 4.5954 8.5388 4.1590 3.5171 9.1938 3.6701 10.1321 9.4157 1.4847 1.4957 2.4245 7.0090 5.3966 7.7209 4.8468 4.0102 7.7888 2.8200 4.6346 3.8354 4.0429 5.5033 3.9515 6.4430 5.5013 5.0897 1.6035 11.2870 8.7391 6.3218 2.1654 8.3102 1.2450 3.5747 1.4680 2.5449 1.4196 6.2634 1.3873 1.2859 1.3312 3.0194 3.1411 1.6904 1.9973 1.0585 1.1628 4.2094 2.5099 4.1907 1.3127 1.1867 9.7556 1.1985 2.2418 1.0453 1.0462 1.1711 1.8842 1.0543 6.5859 6.0507 9.7066 1.0350 1.0355 1.0997 1.0996 1.1011 1.0856 1.1002 1.0892 1.0940 1.0984 1.0975
irintensity: 0.5869 0.0201 1.3319 2.7347 0.2596 0.6199 0.3395 0.0460 0.1957 0.0342 0.9069 1.4067 0.0011 1.3960 5.7249 7.2422 1.3030 1.4904 0.0004 0.4443 8.6794 9.5762 10.9916 23.7077 0.4564 13.1435 17.3884 71.8728 109.6446 149.9908 0.9901 24.3687 45.5716 0.0197 12.1766 2.3522 22.5942 3.1598 3.4147 0.1783 3.0193 0.1548 134.7072 330.5349 28.8714 215.8472 0.1040 19.2112 2.4683 77.7485 224.2591 1.0600 35.9163 2.2200 57.8757 16.6323 2.8357 2.2465 46.9205 0.3553 25.6193 29.5643 16.2206 148.5274 9.0505 9.1111 3.1031 18.8115 4.2930 0.4124 1.8509 10.1385 14.6404 21.1222 7.5509
temp: 298.150 k
press: 1.00000 atm
elementType: 17 17 17 8 8 6 6 6 6 6 6 6 6 6 6 6 1 1 1 1 1 1 1 1 1 1 1
symmnumber: 1
zpe: 508522.9 jmol-1
zpe.correction: 0.193686 hartree
zpe.thermalcorrener: 0.210319 hartree
zpe.thermalcorrenthalpy: 0.211263 hartree
zpe.thermalcorrgfe: 0.147943 hartree
zpe.sumelectzpe: -1955.210835 hartree
zpe.sumelectthermal: -1955.194202 hartree
zpe.sumelectthermalent: -1955.193258 hartree
zpe.sumelectthermalfe: -1955.256577 hartree
dipole: 1.5890 0.0053 -0.0290
dipole: 1.5893
quadrupole: -102.1104 -113.8790 -115.4657
quadrupole: -9.4846 0.0835 0.0840
quadrupole: 8.3746 -3.3939 -4.9807 -9.4846 0.0835 0.0840
hfenergy: -1955.4045207 hartree
pointgroup: C01 [X(C11H11Cl3O2)]
dipole: 0.6238467 0.0409393 0.0103106 debye
polarizability: 206.7381302|-14.3069555|151.3791938|3.8528458|-0.4192065|104.0111064 unknown
InChI: InChI=1S/C11H11Cl3O2/c1-10(2,11(12,13)14)16-9(15)8-6-4-3-5-7-8/h3-7H,1-2H3
charge 0 multiplicity 1
27 atoms
Cl -2.250507 -1.774467 -1.591458
Cl -4.551771 -0.384708 -0.214757
Cl -2.386674 -1.719325 1.413925
O  -0.510215 0.13467 -0.044927
O  0.465827 2.272111 -0.035073
C  -1.921934 0.63656 -0.114129
C  -2.713668 -0.718938 -0.125039
C  -2.253966 1.475214 1.138278
C  -2.143912 1.430784 -1.418715
C  0.577252 1.022022 -0.016722
C  1.868026 0.275785 0.031534
C  3.067361 1.034556 0.078586
C  1.924005 -1.143026 0.028801
C  4.314181 0.379116 0.123444
C  3.175369 -1.792776 0.073234
C  4.370218 -1.035539 0.120814
H  -1.663749 2.403497 1.103126
H  -3.325991 1.732889 1.151814
H  -2.007374 0.925728 2.06069
H  -1.823775 0.848593 -2.297486
H  -1.555112 2.359243 -1.367047
H  -3.209859 1.68915 -1.530985
H  2.998049 2.127345 0.078777
H  0.994526 -1.716955 -0.008936
H  5.23877 0.964985 0.160143
H  3.220634 -2.887103 0.070648
H  5.339789 -1.545009 0.155463
