program: Gaussian 09
title: 000249543
version: EM64L-G09RevD.01
frameworkgroup: C1[X(C9H15N)]
method: RPBEPBE
basis: SDD
operation: Freq
keyword: #pfreq=noraman
keyword: PBEPBE/SDD
title: #p freq=noraman PBEPBE/SDD
converged: YES YES NO NO
title: Mulliken charges:
elementType: N C C C C C C C C C H H H H H H H H H H H H H H H
charge: -0.034520 -0.481791 0.281984 -0.365165 0.235712 -0.505366 -0.812452 -0.684786 -0.676877 -0.293401 0.239939 0.195664 0.228356 0.194368 0.210423 0.230258 0.231184 0.235175 0.242721 0.208379 0.221861 0.221691 0.221191 0.218171 0.237283
chargesum: 0.00000
title: Mulliken charges with hydrogens summed into heavy atoms:
elementType: N C C C C C C C C C
charge: -0.034520 -0.046187 0.281984 0.057559 0.235712 -0.064685 -0.103373 -0.032855 -0.000232 -0.293401
polarizability: 1.20687136e+02 -8.03720409e+00 1.17408419e+02 -3.71313875e+00 1.06274469e+00 7.43456399e+01
1716.lowfreq: -27.2015 -9.0403 -5.8028 0.0003 0.0005 0.0007 10.3754 45.0682 68.5554
frequency: -24.1750 44.8634 68.5069 73.8697 98.3509 150.3295 166.0541 199.8874 220.3840 231.0661 291.7884 327.6542 365.9428 412.7202 452.8148 513.4410 584.7212 631.5283 699.2779 742.3720 774.6508 859.2440 872.2260 923.2438 959.6513 1001.9531 1014.6414 1050.8739 1054.9596 1069.0031 1092.5635 1149.6006 1167.5166 1224.8043 1260.9645 1270.1508 1290.7810 1292.5975 1309.6550 1333.6661 1388.3220 1389.2551 1393.0541 1454.0230 1463.2785 1467.7433 1473.1091 1474.7333 1477.1389 1481.9297 1487.4030 1492.5990 1637.6028 2149.1816 2969.8421 2973.9391 2976.0638 2982.2485 2983.3355 3001.6204 3027.2981 3040.3031 3051.0792 3054.8663 3075.0253 3078.0088 3081.0620 3088.4651 3105.3860
redmass: 2.5470 2.9531 3.4523 1.7286 1.1002 4.1618 3.6717 2.5827 1.1143 1.1760 2.9541 2.2568 2.7390 3.7762 3.3141 3.9021 5.1362 4.8794 3.5542 1.1030 1.2243 1.5823 1.5252 2.2719 1.9808 1.4484 1.5108 2.5807 2.0116 1.6906 2.1303 2.1473 3.2358 1.4943 1.2708 1.3885 1.4179 1.4122 1.6266 1.4110 1.2023 1.2102 1.2291 1.0807 1.0523 1.0796 1.0429 1.0521 1.0513 1.0488 1.0843 1.0913 6.7680 12.6272 1.0455 1.0487 1.0423 1.0350 1.0618 1.0620 1.0973 1.0948 1.1019 1.0993 1.1006 1.1004 1.1000 1.1015 1.0957
irintensity: 0.3074 1.3688 1.1511 0.4394 0.1802 2.2168 0.9038 0.1467 0.1683 0.0401 0.7479 0.5247 0.4622 0.2888 2.1128 2.8668 0.5302 0.8050 0.1439 6.2423 5.1886 2.9369 3.2222 1.0283 12.3832 2.6482 0.5752 1.7534 2.6539 10.1844 19.3695 10.1378 1.2117 0.5894 3.3194 0.7574 1.5858 0.9193 2.5859 3.5651 11.6207 8.6463 23.9924 6.3112 5.3135 1.8575 15.8441 5.3571 11.4969 1.7244 30.5955 15.2327 22.6910 37.2977 8.0410 19.2150 50.1405 29.9772 42.2538 22.9256 2.0365 16.3245 7.3600 5.5896 60.9294 51.5892 44.7441 41.0171 27.9154
temp: 298.150 k
press: 1.00000 atm
elementType: 7 6 6 6 6 6 6 6 6 6 1 1 1 1 1 1 1 1 1 1 1 1 1 1 1
symmnumber: 1
zpe: 568024.2 jmol-1
zpe.correction: 0.216349 hartree
zpe.thermalcorrener: 0.228352 hartree
zpe.thermalcorrenthalpy: 0.229297 hartree
zpe.thermalcorrgfe: 0.177891 hartree
zpe.sumelectzpe: -405.895293 hartree
zpe.sumelectthermal: -405.883289 hartree
zpe.sumelectthermalent: -405.882345 hartree
zpe.sumelectthermalfe: -405.933751 hartree
dipole: 0.3102 -4.5947 0.2237
dipole: 4.6106
quadrupole: -57.5513 -72.5990 -62.4312
quadrupole: 2.3243 -1.3619 0.7835
quadrupole: 6.6425 -8.4051 1.7626 2.3243 -1.3619 0.7835
hfenergy: -406.1116419 hartree
pointgroup: C01 [X(C9H15N1)]
dipole: 0.1450959 -1.7970251 0.2000327 debye
dipolederiv: -0.241182 -0.0025834 -0.008106 0.0905819 -0.4934111 0.0039368 -0.0208931 0.0309857 -0.2552012 -0.2173887 -0.0657649 -0.0167111 -0.0670466 0.0298307 0.0302861 -0.1433385 0.0999557 0.092315 0.3443796 -0.2022812 -0.0653531 -0.0993996 0.4036963 -0.0027029 -0.1583892 0.0373931 -0.082548 0.1100553 -0.0106658 0.0325792 -0.0300571 0.1615149 -0.0009896 0.200857 -0.0425539 0.0797588 0.0792999 0.094455 -0.0774415 0.19559 -0.2534808 -0.0174089 -0.0555502 -0.0334257 -0.043996 0.045645 0.0438111 -0.0037725 0.0208037 0.0670239 0.0071732 -0.0712619 0.0312383 0.1289596 -0.0344685 0.0592985 0.0072917 -0.0077941 -0.2257805 0.0213004 0.0503017 -0.0544135 0.0505393 -0.0728604 -0.0325264 0.0151834 -0.0450031 0.0737661 0.0182938 -0.0748171 0.0329127 0.0634135 -0.0070908 -0.006488 -0.038533 -0.0381835 0.0749546 0.006253 0.0516697 -0.0034068 0.0051063 -0.097491 0.0020839 0.0372854 -0.1605981 0.4520255 -0.0104067 0.0684643 -0.0568681 0.0027736 0.0451711 0.0051303 -0.0224608 -0.0107038 -0.0669013 0.1025467 -0.0006637 0.0455173 0.0283493 0.002734 0.0593538 0.052238 0.0439053 -0.0237764 -0.1317384 0.07491 -0.1075253 -0.0375327 0.0023556 0.0468185 0.0712498 0.0315874 -0.0145666 -0.11166 0.0409303 -0.0793968 -0.0393011 0.0446594 -0.0190261 -0.0065279 0.0050173 -0.1296227 0.1361854 -0.0104758 0.0992727 -0.003069 0.0230251 0.0015602 -0.0371994 -0.0244279 -0.0984977 0.1332858 -0.0251625 0.0786804 0.0161186 0.0028746 0.0243343 0.0263675 0.0348373 -0.0022803 -0.1346505 0.0439568 -0.0908132 -0.0298691 -0.0697473 -0.1118735 0.0953312 -0.0667664 0.0664138 0.0171865 0.0867613 0.0607894 0.0491987 -0.0393384 0.0790096 -0.1016194 0.0809749 0.0465657 0.0178562 -0.1075772 0.0811547 0.0490546 0.1093414 -0.0102767 0.0214901 0.0357459 -0.0065824 -0.0531093 0.0189737 -0.1026531 -0.0698876 0.0399812 0.0255735 0.052132 0.0790776 -0.0372653 -0.1273085 0.1062808 -0.1072872 -0.0298172 0.0736935 0.0449228 -0.0162006 -0.0131751 -0.0981678 0.1093931 0.0307635 0.1065457 0.0311702 -0.1153159 -0.0252875 -0.1121985 -0.0414143 0.0974924 -0.0144884 -0.1431206 -0.0245487 -0.0483758 -0.2083063 -0.0551863 0.0586017 -0.0763285 0.0900465 0.0184477 0.0623236 0.0262182 0.0477814 0.0690503 0.07052 0.0475891 0.0246565 -0.0311517 -0.125534 0.0012397 -0.1001851 -0.03313 0.1109233 -0.0149117 -0.0112154 0.0381201 -0.081846 0.1078526 -0.0261828 0.0724134 0.028189 unknown
polarizability: 120.9857615|-8.1802378|117.1453759|-2.6603388|-1.7113009|74.3100568 unknown
InChI: InChI=1S/C9H15N/c1-4-6-8(3)9(5-2)7-10/h4-6H2,1-3H3
charge 0 multiplicity 1
25 atoms
N  -0.672546 2.609476 -0.266199
C  1.451184 -0.347842 -0.611285
C  0.104355 -0.849033 -0.10843
C  2.500449 -0.191798 0.52973
C  -0.935573 0.015837 0.161182
C  -2.324714 -0.36951 0.673987
C  0.007275 -2.34802 0.084278
C  3.874336 0.260259 -0.008789
C  -3.374441 -0.446269 -0.465133
C  -0.765823 1.428229 -0.084112
H  1.339441 0.628489 -1.118035
H  1.85215 -1.061966 -1.359315
H  2.122169 0.546356 1.262489
H  2.6107 -1.151873 1.071938
H  -2.279251 -1.337219 1.203683
H  -2.655015 0.380474 1.417184
H  -0.912997 -2.674693 0.592488
H  0.87299 -2.720943 0.664196
H  0.04777 -2.856901 -0.899472
H  4.282725 -0.474087 -0.728649
H  3.79405 1.23316 -0.528073
H  4.606493 0.374142 0.81112
H  -4.372085 -0.696373 -0.06055
H  -3.097355 -1.217205 -1.20649
H  -3.45369 0.52041 -0.994141
