program: Gaussian 09
title: 000249538
version: EM64L-G09RevD.01
frameworkgroup: C1[X(C13H25NO3)]
method: RPBEPBE
basis: SDD
operation: Freq
keyword: #p
keyword: freq=noraman
keyword: PBEPBE/SDD
title: #p freq=noraman PBEPBE/SDD
converged: YES YES NO NO
title: Mulliken charges:
elementType: O O O N C C C C C C C C C C C C C H H H H H H H H H H H H H H H H H H H H H H H H H
charge: -0.274981 -0.297609 -0.262828 -0.129456 -0.373917 -0.353810 0.234429 -0.346537 -0.348681 -0.528236 -0.528068 -0.674992 -0.682739 0.256188 0.037875 -0.684285 -0.685847 0.233543 0.213568 0.250420 0.194351 0.208152 0.205296 0.240054 0.188135 0.268280 0.233008 0.249671 0.287476 0.224932 0.210000 0.214143 0.221171 0.203446 0.219700 0.229534 0.221433 0.211197 0.253456 0.225116 0.206908 0.230502
chargesum: 0.00000
title: Mulliken charges with hydrogens summed into heavy atoms:
elementType: O O O N C C C C C C C C C C C C C
charge: -0.274981 -0.297609 -0.262828 -0.129456 0.073194 0.090960 0.234429 0.066911 0.079508 -0.026947 0.009079 -0.025917 -0.038423 0.256188 0.267410 0.001801 -0.023320
polarizability: 2.03915999e+02 1.12733044e+00 1.52121737e+02 4.12166147e+00 5.15635094e+00 1.29428933e+02
1716.lowfreq: -8.5276 -0.0008 -0.0006 -0.0004 3.4846 8.2750 16.9944 20.7931 37.1666
frequency: 16.7949 20.7136 37.1626 45.6528 54.4033 69.7561 82.8279 85.1454 90.1991 97.2183 114.8952 141.7606 178.4859 192.4455 198.2071 221.0820 225.0477 243.0219 249.5219 269.9484 301.4374 304.9191 334.1763 370.3702 386.0809 412.5355 429.9043 475.9740 545.5472 566.2878 583.6524 631.0526 679.4271 741.9353 747.7511 766.1989 792.1622 824.6254 864.3913 866.7625 886.6357 887.0720 894.8078 926.1716 930.5375 944.6070 983.1658 1015.7154 1045.3685 1051.4249 1084.5650 1093.5198 1098.4756 1104.0048 1111.5026 1135.0423 1148.1674 1158.1936 1161.5935 1184.1406 1208.6103 1224.1505 1240.7547 1263.3162 1286.2358 1296.1457 1298.0513 1302.7663 1309.8778 1321.4255 1334.9838 1353.2058 1359.9083 1364.2612 1380.2924 1391.2494 1393.1407 1394.7363 1417.0974 1444.2987 1448.6193 1457.0180 1457.9725 1466.0494 1472.9849 1473.2917 1473.3744 1478.8333 1479.8422 1481.3086 1486.3134 1487.9120 1493.9388 1580.4630 1626.0825 2974.2334 2976.6404 2979.3272 2983.6225 2983.7835 2988.9449 2991.9004 2992.4136 2994.7926 2997.5011 3024.4392 3029.2888 3039.7112 3042.5753 3058.6317 3065.6378 3074.8183 3076.7413 3077.9566 3080.6585 3080.9335 3084.0432 3092.8319 3097.9147 3104.2072
redmass: 3.3664 3.9132 4.1937 3.2161 3.3605 4.3483 1.8796 2.5291 2.5588 3.3330 3.1821 2.2512 2.7411 2.4178 1.2027 1.1914 1.1568 1.1698 2.8004 2.8914 3.6713 3.0305 2.8769 3.0459 3.2852 2.9118 3.0540 2.9315 3.1039 3.2916 3.5572 4.4093 4.5345 1.1033 1.1224 3.3051 2.7479 2.2726 1.3952 1.2960 2.0537 1.7633 2.1042 1.2298 3.1414 1.5312 3.0352 2.1492 2.9722 2.8866 3.0735 1.6910 1.9476 2.1273 2.2244 1.8362 1.8279 1.9808 1.6265 1.8982 2.5012 1.4736 1.2634 1.4152 1.2004 1.3188 1.2464 1.2859 1.2879 1.4415 1.3672 1.5474 1.5859 1.3808 1.2608 1.2096 1.2089 1.2296 2.4803 1.0922 1.1110 1.0525 1.1232 1.0477 1.0702 1.0527 1.0567 1.0432 1.0510 1.0800 1.0724 1.0472 1.1062 6.1858 9.3897 1.0363 1.0362 1.0628 1.0612 1.0617 1.0356 1.0632 1.0359 1.0634 1.0650 1.0863 1.0982 1.0951 1.0971 1.1002 1.0998 1.1016 1.0956 1.0996 1.1022 1.0995 1.0994 1.0988 1.1006 1.1006
irintensity: 0.2639 0.8753 1.7462 0.3258 0.8513 1.7851 0.7948 1.3017 0.5991 1.2453 3.8019 1.9859 5.4849 4.2487 1.9488 1.1123 0.7165 0.2448 0.5399 12.8603 1.7337 0.0794 7.5712 13.1791 4.9298 8.1202 3.3758 8.8202 5.5046 11.7803 10.1130 4.9381 2.0382 8.1458 14.5484 7.5083 6.5673 16.3469 2.0794 1.8399 2.9217 19.4399 3.6521 6.2641 56.9262 7.4606 10.0321 16.8040 1.7355 1.1794 2.1160 40.0409 234.1541 1.8993 3.0733 167.2615 124.8644 14.0314 25.8382 3.4839 17.3984 14.5410 132.0100 13.3485 0.6791 3.4638 5.2807 25.5103 54.3599 8.0794 7.1293 29.5275 26.5110 2.4327 33.2809 13.2492 14.0440 15.7796 107.5868 4.9862 61.7923 6.5825 17.9497 4.5282 3.2578 1.9977 6.4244 10.6021 12.5202 4.3548 16.9299 21.2950 16.2814 281.0219 132.1377 42.5034 32.2835 12.6553 0.6860 12.4499 16.1051 71.2610 30.1475 43.4168 33.7446 7.2724 4.5982 2.4233 10.0481 5.3462 14.9802 81.1285 13.5136 42.0419 56.0803 45.7464 5.4204 54.2008 23.3694 29.8861
temp: 298.150 k
press: 1.00000 atm
elementType: 8 8 8 7 6 6 6 6 6 6 6 6 6 6 6 6 6 1 1 1 1 1 1 1 1 1 1 1 1 1 1 1 1 1 1 1 1 1 1 1 1 1
symmnumber: 1
zpe: 956691.0 jmol-1
zpe.correction: 0.364384 hartree
zpe.thermalcorrener: 0.385973 hartree
zpe.thermalcorrenthalpy: 0.386917 hartree
zpe.thermalcorrgfe: 0.310614 hartree
zpe.sumelectzpe: -789.445673 hartree
zpe.sumelectthermal: -789.424085 hartree
zpe.sumelectthermalent: -789.423141 hartree
zpe.sumelectthermalfe: -789.499444 hartree
dipole: 0.9589 2.8698 0.1705
dipole: 3.0305
quadrupole: -81.2513 -107.0296 -110.6228
quadrupole: 4.7722 3.4965 -4.5857
quadrupole: 18.3832 -7.3950 -10.9883 4.7722 3.4965 -4.5857
hfenergy: -789.8100578 hartree
pointgroup: C01 [X(C13H25N1O3)]
dipole: -0.3364542 1.1303963 0.17488 debye
polarizability: 203.7743597|-3.7380271|153.4381748|3.1570108|-0.1317007|128.2541338 unknown
InChI: InChI=1S/C13H25NO3/c1-5-9-14(10-6-2)12(15)7-8-13(16)17-11(3)4/h11H,5-10H2,1-4H3
charge 0 multiplicity 1
42 atoms
O  3.702115 -0.399404 0.357829
O  -1.149296 -1.849946 0.425373
O  2.589481 0.586489 -1.442402
N  -2.440583 0.045089 0.061735
C  -2.601726 1.471723 -0.293264
C  -3.675065 -0.749914 0.271203
C  -1.216687 -0.603625 0.161255
C  -2.724607 2.409551 0.933313
C  -4.205126 -1.389622 -1.033496
C  0.0510 0.232857 -0.081672
C  1.310781 -0.533083 0.356234
C  -2.957994 3.876562 0.513741
C  -5.510638 -2.177208 -0.794952
C  2.557455 -0.040925 -0.35431
C  5.035503 -0.055081 -0.263391
C  5.389437 -1.127375 -1.303755
C  6.01535 0.023902 0.908917
H  -1.760094 1.797012 -0.929741
H  -3.514714 1.566589 -0.91375
H  -3.443971 -1.547231 0.999045
H  -4.445286 -0.086819 0.711556
H  -1.805636 2.331573 1.546254
H  -3.558378 2.062188 1.574273
H  -3.422933 -2.061399 -1.43232
H  -4.375658 -0.60015 -1.793217
H  0.139082 0.463554 -1.162606
H  -0.010127 1.205948 0.438823
H  1.468135 -0.489158 1.44713
H  1.165536 -1.60715 0.123594
H  -3.045561 4.533874 1.397053
H  -3.887732 3.981216 -0.076979
H  -2.122388 4.254255 -0.105107
H  -5.876742 -2.634279 -1.731757
H  -6.311999 -1.521191 -0.403982
H  -5.35326 -2.991173 -0.06287
H  4.9150 0.92652 -0.758979
H  5.431693 -2.125177 -0.832035
H  6.378563 -0.910079 -1.747382
H  4.644831 -1.145201 -2.117029
H  6.082585 -0.949295 1.426249
H  7.021766 0.294105 0.540919
H  5.693889 0.785375 1.639901
