program: Gaussian 09
title: 000249531
version: EM64L-G09RevD.01
frameworkgroup: C1[X(C9H16O3)]
method: RPBEPBE
basis: SDD
operation: Freq
keyword: #pfreq=noraman
keyword: PBEPBE/SDD
title: #p freq=noraman PBEPBE/SDD
converged: YES YES NO NO
title: Mulliken charges:
elementType: O O O C C C C C C C C C H H H H H H H H H H H H H H H H
charge: -0.283005 -0.438031 -0.250556 0.025315 -0.471993 -0.098486 -0.429396 -0.422415 -0.424905 0.277462 -0.493329 -0.662276 0.227253 0.207934 0.237840 0.229198 0.242430 0.204873 0.193100 0.230872 0.195548 0.220093 0.324662 0.239070 0.242960 0.235578 0.215680 0.224525
chargesum: 0.00000
title: Mulliken charges with hydrogens summed into heavy atoms:
elementType: O O O C C C C C C C C C
charge: -0.283005 -0.113369 -0.250556 0.252567 -0.026219 0.130712 0.017907 0.001557 -0.009264 0.277462 -0.011299 0.013507
polarizability: 1.29242236e+02 -1.56481049e-01 9.11027132e+01 -1.66302559e+00 3.79432731e+00 9.25094514e+01
1716.lowfreq: -20.6620 -15.1594 -2.5622 0.0005 0.0006 0.0011 17.4001 50.8923 60.8350
frequency: -17.1058 50.7131 60.7037 80.7683 141.3569 159.7517 192.8649 247.8414 248.8527 256.4823 288.9922 336.4726 359.9200 400.8946 451.7032 482.2913 525.3613 548.4507 639.6282 659.4201 762.2636 791.5680 800.5938 833.2336 856.2562 879.0002 894.6227 923.0343 948.8672 982.1252 1016.0567 1039.9665 1064.5651 1076.6566 1084.2291 1090.3223 1105.8742 1132.2911 1149.5262 1185.6079 1211.7881 1243.2041 1254.4413 1263.9166 1281.2187 1308.5034 1316.3799 1331.2265 1341.8342 1347.3211 1350.8575 1366.5193 1374.6531 1397.6744 1444.4174 1449.8381 1455.3032 1471.6344 1474.1873 1480.9384 1483.1845 1640.2071 2966.4094 2983.6227 2987.0409 2992.4755 2995.7761 2998.7294 3003.5901 3042.9336 3053.0369 3054.7980 3055.5116 3064.0987 3073.9341 3094.9718 3104.2825 3555.9527
redmass: 2.1316 7.5197 3.2348 3.4242 3.1392 3.7969 1.1696 2.2290 2.7384 1.3764 2.9067 4.0403 2.8852 2.4953 1.9438 2.8105 4.7697 2.8058 4.2847 2.3493 3.1445 1.3862 2.2866 3.2980 1.7186 2.2320 1.9055 3.3382 2.7305 2.4654 1.8767 1.4762 1.5820 2.5741 1.6947 1.5683 1.6384 3.0089 1.6946 1.5282 1.4166 1.1783 1.3234 1.4073 1.4817 1.2964 1.3301 1.4746 1.6417 1.5376 1.4757 1.5194 1.1811 1.2101 1.0851 1.0906 1.0893 1.0405 1.0873 1.0895 1.0512 9.4125 1.0676 1.0629 1.0685 1.0629 1.0715 1.0374 1.0676 1.0933 1.0955 1.0987 1.0890 1.1014 1.1011 1.1005 1.1001 1.0658
irintensity: 0.0840 2.0329 1.1510 1.1989 1.9270 3.2215 0.5279 41.8291 17.3924 87.5513 11.3884 8.5790 1.6062 9.2289 1.9041 2.5935 3.8042 2.1006 1.7952 4.9124 7.0774 17.9674 13.1847 4.5455 7.9488 22.3829 2.7466 17.4132 47.0398 39.7012 64.5093 7.0664 11.1833 99.8211 0.2969 2.6885 70.3272 325.0144 3.2025 3.7685 17.4756 1.4721 8.2136 0.8192 7.1950 1.4079 5.7640 31.7255 28.6765 7.0469 3.6725 2.3729 17.0228 19.0720 26.5982 9.2006 9.4033 13.3977 17.6855 9.5628 14.1005 151.0877 28.8259 26.2245 4.4933 18.9596 13.7168 23.4544 36.2568 48.9636 4.3636 30.1082 54.6706 21.9017 30.7432 32.4811 29.9855 3.8847
temp: 298.150 k
press: 1.00000 atm
elementType: 8 8 8 6 6 6 6 6 6 6 6 6 1 1 1 1 1 1 1 1 1 1 1 1 1 1 1 1
symmnumber: 1
zpe: 628431.5 jmol-1
zpe.correction: 0.239357 hartree
zpe.thermalcorrener: 0.251638 hartree
zpe.thermalcorrenthalpy: 0.252582 hartree
zpe.thermalcorrgfe: 0.200657 hartree
zpe.sumelectzpe: -577.266793 hartree
zpe.sumelectthermal: -577.254511 hartree
zpe.sumelectthermalent: -577.253567 hartree
zpe.sumelectthermalfe: -577.305492 hartree
dipole: -0.3379 1.1837 -2.4049
dipole: 2.7017
quadrupole: -72.8693 -74.8866 -74.9632
quadrupole: 7.8161 0.5017 0.7388
quadrupole: 1.3704 -0.6469 -0.7235 7.8161 0.5017 0.7388
hfenergy: -577.5061494 hartree
pointgroup: C01 [X(C9H16O3)]
dipole: -0.1307717 0.518279 -0.9187511 debye
polarizability: 129.2616714|0.1996045|90.6735913|-1.4588585|3.6776593|92.9191376 unknown
InChI: InChI=1S/C9H16O3/c1-2-9(11)12-8-5-3-4-7(10)6-8/h7-8,10H,2-6H2,1H3
charge 0 multiplicity 1
28 atoms
O  -1.024264 -0.311171 -0.731511
O  2.960339 -1.283182 1.070141
O  -2.074563 0.500092 1.191408
C  0.319551 -0.056584 -0.112989
C  1.289059 -1.041946 -0.781822
C  2.750039 -0.809499 -0.318126
C  0.729183 1.410291 -0.335811
C  3.17217 0.669411 -0.486358
C  2.170696 1.642765 0.182596
C  -2.147854 0.03644 0.029852
C  -3.421183 -0.21861 -0.762172
C  -4.685419 -0.188563 0.116165
H  0.219669 -0.253462 0.973429
H  1.230755 -0.905067 -1.879221
H  0.994251 -2.081628 -0.555227
H  3.422786 -1.462833 -0.899462
H  0.016901 2.080819 0.177274
H  0.683807 1.630313 -1.420961
H  3.231188 0.898612 -1.569586
H  4.186036 0.801244 -0.065892
H  2.194345 1.520095 1.28635
H  2.474988 2.688059 -0.009485
H  2.452982 -0.703196 1.693192
H  -3.477848 0.557955 -1.551243
H  -3.313403 -1.180501 -1.295344
H  -4.758988 0.765287 0.66522
H  -5.589059 -0.308335 -0.507004
H  -4.66907 -0.999906 0.864287
