program: Gaussian 09
title: 000249527
version: EM64L-G09RevD.01
frameworkgroup: C1[X(C20H20O3)]
method: RPBEPBE
basis: SDD
operation: Freq
keyword: #pfreq=noraman
keyword: PBEPBE/SDD
title: #p freq=noraman PBEPBE/SDD
converged: YES YES NO NO
title: Mulliken charges:
elementType: O O O C C C C C C C C C C C C C C C C C C C C H H H H H H H H H H H H H H H H H H H H
charge: -0.154129 -0.250538 -0.239423 -0.371416 -0.308553 -0.332734 -0.562664 0.114816 0.574596 0.574389 0.234132 -0.416976 -0.439792 -0.455917 -0.418126 -0.242319 -0.221288 -0.220666 -0.244573 -0.245199 -0.245563 -0.261341 -0.660136 0.276656 0.243507 0.305140 0.270036 0.263706 0.221283 0.235188 0.228566 0.230644 0.224284 0.225990 0.225737 0.225990 0.228956 0.229429 0.224194 0.233807 0.213138 0.250403 0.236766
chargesum: 0.00000
title: Mulliken charges with hydrogens summed into heavy atoms:
elementType: O O O C C C C C C C C C C C C C C C C C C C C
charge: -0.154129 -0.250538 -0.239423 -0.094760 -0.065046 -0.027594 -0.028923 0.114816 0.574596 0.574389 0.234132 -0.195692 -0.204603 -0.227351 -0.187482 -0.018035 0.004702 0.005070 -0.018583 -0.016243 -0.016134 0.196660 0.040172
polarizability: 2.45928061e+02 -9.82251634e+00 2.06072127e+02 -1.17076431e+01 -9.48701236e+00 1.89307882e+02
1716.lowfreq: -11.3311 -8.5208 -1.6077 -0.0010 -0.0005 0.0003 16.2908 21.4246 29.8249
frequency: 16.0917 20.2545 29.8125 31.9563 41.4854 43.4089 66.0608 81.7981 91.3752 127.1712 152.2324 178.4511 211.2076 219.5181 227.3318 242.3544 248.4706 312.2249 332.7150 371.3462 403.5359 404.3182 426.3262 443.5670 491.9408 509.7765 514.7835 556.1245 576.4801 605.4343 615.8625 616.5592 633.2581 658.8630 704.8293 706.3201 708.3040 755.1421 774.0520 781.7505 808.0823 813.2113 828.2814 849.0792 850.4791 852.2588 901.4233 917.3155 918.3609 931.7890 973.8472 975.1800 990.3147 990.5161 994.0163 994.8952 1002.8258 1009.6294 1026.5051 1029.5240 1055.3399 1068.1618 1080.0987 1084.1576 1096.0516 1110.3070 1119.9087 1146.0377 1158.6554 1172.5861 1172.8230 1185.9642 1190.8742 1191.9693 1213.2466 1218.0448 1230.3661 1236.3526 1265.8665 1276.1471 1295.6103 1306.8652 1312.0950 1347.5610 1352.5396 1359.5650 1386.8030 1388.2851 1392.7112 1423.7179 1443.6214 1445.2909 1457.5628 1462.4641 1483.8065 1484.7460 1485.2865 1592.8996 1593.7682 1614.0937 1614.7763 1625.1559 1663.5512 2984.5792 2991.5513 2995.0234 3007.5013 3020.9372 3030.8854 3074.8385 3090.9283 3096.4465 3105.2215 3109.2937 3118.4723 3122.1767 3123.0244 3132.4657 3133.4844 3144.2096 3144.9245 3163.0889 3163.2816
redmass: 5.6379 3.9521 4.5887 3.7643 3.9472 3.9803 4.5664 5.5872 4.5077 3.2761 5.0594 2.5243 2.4542 2.9970 6.1428 2.7308 4.0337 3.2075 5.6723 4.1329 2.8087 2.8104 3.6657 3.6554 3.8976 3.5341 3.7002 3.3279 3.2650 6.1923 6.3454 6.3965 5.6177 5.3987 1.7926 1.9483 2.6793 2.2260 1.9974 2.4724 2.4669 1.5022 3.9633 1.5228 2.3712 1.2652 2.4429 1.4888 1.5122 3.1727 1.3910 1.3901 6.1064 6.0119 1.3265 1.3665 3.2877 2.8364 2.3183 2.1308 3.2665 2.5808 1.5961 2.3226 2.1652 2.0825 2.7207 2.0495 1.7334 1.0551 1.0545 1.4004 1.1301 1.1349 1.9264 1.9551 1.4547 1.5499 1.6185 1.1234 1.5123 1.4058 1.4836 1.3908 1.3093 1.5783 5.4766 4.1589 1.2291 1.0984 2.1201 2.0662 1.0924 1.0464 1.0579 2.2953 2.3079 5.9899 5.8747 6.1333 6.1082 8.7163 12.4121 1.0715 1.0772 1.0364 1.0831 1.0828 1.0596 1.0957 1.0976 1.1030 1.0877 1.0879 1.0868 1.1058 1.0859 1.0902 1.0909 1.0955 1.0957 1.1014 1.1014
irintensity: 0.9054 0.2414 1.1712 0.5668 0.4198 1.1783 2.2595 2.1419 0.3875 1.0965 1.5760 0.7436 0.9636 2.1878 0.4632 0.6474 0.7340 21.6151 0.7678 3.5545 0.0090 0.0563 4.0776 2.2849 19.9867 4.5148 1.8577 11.9485 15.4152 9.1645 0.6765 2.1247 1.3434 4.4975 62.9446 38.5743 10.4476 23.4157 56.3779 9.4299 2.6955 4.7073 3.3344 0.8790 2.9053 0.3547 0.8475 5.9901 3.4354 9.7170 0.0959 0.0750 0.2083 0.7036 0.1913 1.1365 6.8994 65.9362 14.9223 7.7007 2.2601 20.1372 12.6375 102.5228 73.7547 192.2786 81.2312 7.7589 20.9806 0.0937 0.2037 20.9698 1.4654 2.6156 0.7770 2.2418 83.9928 72.2655 40.6631 6.9068 19.6013 3.9626 32.8661 0.1222 2.7867 10.8404 0.4703 1.9577 24.6913 16.3435 12.0830 4.4271 16.2602 13.6181 16.4510 13.9621 17.2665 0.6711 4.1058 8.6736 5.5175 177.9873 183.7734 4.6521 9.9536 19.2632 11.9661 7.8888 29.5836 7.9009 33.5469 1.8192 15.3916 13.1038 6.3565 29.6215 2.4786 8.4087 12.3276 28.6588 43.2881 21.8985 26.9448
temp: 298.150 k
press: 1.00000 atm
elementType: 8 8 8 6 6 6 6 6 6 6 6 6 6 6 6 6 6 6 6 6 6 6 6 1 1 1 1 1 1 1 1 1 1 1 1 1 1 1 1 1 1 1 1
symmnumber: 1
zpe: 910047.7 jmol-1
zpe.correction: 0.346619 hartree
zpe.thermalcorrener: 0.367704 hartree
zpe.thermalcorrenthalpy: 0.368648 hartree
zpe.thermalcorrgfe: 0.292458 hartree
zpe.sumelectzpe: -998.157972 hartree
zpe.sumelectthermal: -998.136887 hartree
zpe.sumelectthermalent: -998.135942 hartree
zpe.sumelectthermalfe: -998.212133 hartree
dipole: -1.3680 1.8674 -0.2096
dipole: 2.3244
quadrupole: -122.7114 -134.9090 -130.5755
quadrupole: 6.3206 3.2604 -5.4506
quadrupole: 6.6872 -5.5104 -1.1769 6.3206 3.2604 -5.4506
hfenergy: -998.5045904 hartree
pointgroup: C01 [X(C20H20O3)]
dipole: -0.5478676 0.6906577 -0.2431089 debye
polarizability: 210.659028|5.0354047|246.0899866|-2.3880238|-13.5876192|184.5590557 unknown
InChI: InChI=1S/C20H20O3/c1-2-23-20(22)19-17(21)13-16(14-9-5-3-6-10-14)18(19)15-11-7-4-8-12-15/h3-12,16,18-19H,2,13H2,1H3
charge 0 multiplicity 1
43 atoms
O  0.997791 -2.707299 2.208966
O  -1.186235 -3.590806 -0.244857
O  0.5560 -2.69065 -1.515871
C  -0.009912 -0.089484 -0.169582
C  0.659297 0.729262 1.000002
C  -0.296201 -1.482913 0.455317
C  1.521492 -0.327087 1.737671
C  0.78495 -1.656013 1.568486
C  -1.225093 0.589287 -0.787184
C  1.422288 1.960858 0.528381
C  -0.242623 -2.621207 -0.551088
C  -2.392249 0.847968 -0.020131
C  -1.209585 0.988246 -2.14643
C  1.023829 3.256498 0.940322
C  2.541277 1.842515 -0.338501
C  -3.511187 1.486281 -0.597121
C  -2.327194 1.628066 -2.728803
C  1.72324 4.405829 0.506296
C  3.243025 2.986767 -0.774612
C  -3.483018 1.879618 -1.955906
C  2.837382 4.275005 -0.35255
C  -1.16714 -4.835921 -1.079746
C  -0.138716 -5.828829 -0.532727
H  0.749819 -0.241212 -0.960555
H  -0.14635 1.061012 1.684268
H  -1.28123 -1.516967 0.958789
H  1.708514 -0.104557 2.801812
H  2.514081 -0.432299 1.254373
H  -2.434191 0.549096 1.035775
H  -0.315268 0.794292 -2.750646
H  0.155434 3.36571 1.601933
H  2.869388 0.852658 -0.681638
H  -4.404392 1.676325 0.008954
H  -2.295521 1.928607 -3.78211
H  1.398139 5.399011 0.836085
H  4.104362 2.876159 -1.443179
H  -4.351354 2.374583 -2.40494
H  3.382138 5.163489 -0.690729
H  -2.198211 -5.214267 -0.99647
H  -0.945434 -4.552294 -2.123602
H  -0.202748 -6.77845 -1.095908
H  0.884855 -5.432577 -0.637904
H  -0.327448 -6.041211 0.533159
