program: Gaussian 09
title: 000249516
version: EM64L-G09RevD.01
frameworkgroup: C1[X(C10H19NO3)]
method: RPBEPBE
basis: SDD
operation: Freq
keyword: #p
keyword: freq=noraman
keyword: PBEPBE/SDD
title: #p freq=noraman PBEPBE/SDD
converged: YES YES NO NO
title: Mulliken charges:
elementType: O O O N C C C C C C C C C C H H H H H H H H H H H H H H H H H H H
charge: -0.253957 -0.297812 -0.248321 -0.095082 -0.390874 -0.333479 -0.406283 -0.332823 -0.301772 0.226753 -0.691183 -0.791852 0.291712 -0.749235 0.226209 0.227416 0.198592 0.199173 0.260129 0.245769 0.194004 0.195530 0.267124 0.235540 0.214715 0.218922 0.212797 0.266372 0.231330 0.237000 0.245872 0.253215 0.244499
chargesum: 0.00000
title: Mulliken charges with hydrogens summed into heavy atoms:
elementType: O O O N C C C C C C C C C C
charge: -0.253957 -0.297812 -0.248321 -0.095082 0.062751 0.064286 0.099614 0.056711 0.200893 0.226753 -0.044750 -0.057149 0.291712 -0.005649
polarizability: 1.23420327e+02 -3.91078506e+00 1.41262667e+02 -5.23575862e+00 -1.62677062e+00 1.07801306e+02
1716.lowfreq: -28.2860 -8.5454 -8.0696 -0.0005 -0.0003 0.0007 12.7781 19.1377 27.6922
frequency: -27.9527 18.9551 27.6742 47.7495 51.3829 70.3652 82.4812 102.3151 110.7259 117.5971 164.0225 182.7619 235.1390 246.1015 277.2779 300.0802 345.1535 387.3634 400.8305 434.5223 442.9463 497.2531 572.0294 574.6557 602.0722 633.7094 721.9938 732.7121 755.9961 785.3852 861.8721 899.1358 906.9508 939.8795 958.2011 991.9650 998.6094 1012.7636 1031.7342 1042.1321 1049.8709 1072.5126 1084.3519 1112.1596 1156.8062 1194.1156 1200.6355 1222.5771 1248.4531 1264.5035 1279.5675 1286.6174 1301.6793 1340.7082 1354.9221 1356.4789 1367.2947 1375.2369 1383.4738 1390.0107 1410.6891 1440.1294 1446.6492 1451.8900 1453.8843 1454.8915 1468.0263 1472.5583 1476.0085 1478.0279 1484.8651 1491.6494 1587.5960 1645.5537 2963.0930 2973.8909 2975.8329 2988.9913 3002.3642 3004.9876 3006.1397 3016.1403 3031.9160 3035.3569 3067.3709 3073.0253 3075.3025 3076.8481 3085.6046 3098.8705 3128.9643 3134.3468 3138.6270
redmass: 1.0223 3.7714 6.1593 2.6492 4.5583 1.8589 4.8428 4.3640 2.2657 3.4542 1.5934 1.7590 1.1023 3.9412 3.4745 2.5623 3.1491 2.4368 2.8940 2.8632 2.8968 2.6653 3.3578 3.1700 3.7765 4.0525 3.4271 1.0868 4.4143 1.1887 3.0617 1.7342 1.6880 1.5373 2.6078 1.7049 2.0850 3.5086 1.6841 1.6757 2.9362 2.4751 1.9106 2.3247 2.1092 2.5071 2.9665 1.5406 1.3126 1.2849 1.3068 1.0708 1.4473 1.3798 1.3330 1.4395 1.2929 1.2151 1.2419 1.2130 2.1599 1.2131 1.0953 1.0777 1.0591 1.0578 1.0923 1.0715 1.0667 1.0426 1.0933 1.1162 5.5480 8.9491 1.0590 1.0545 1.0410 1.0383 1.0825 1.0786 1.0381 1.0606 1.1016 1.0620 1.1020 1.1010 1.0995 1.0979 1.1029 1.0943 1.0983 1.1044 1.1025
irintensity: 0.3872 0.1744 1.4131 0.9683 2.6058 0.5722 2.4278 2.4825 0.2627 8.7518 1.4481 0.7255 0.0804 1.2002 9.0020 7.2029 4.9738 1.8513 7.9834 3.2531 13.2716 3.9738 5.7817 4.9531 2.7563 19.2212 1.9883 9.6166 15.2337 0.1123 9.6775 8.3140 12.1632 4.5002 16.5072 6.6895 66.6454 33.5533 6.4082 16.6559 16.2021 0.5575 5.7638 10.1351 54.7436 67.5069 255.1342 14.1033 7.2105 2.0878 44.3181 1.2842 12.5813 3.5062 6.7109 8.6317 16.1676 25.6716 55.6300 8.6526 110.3737 44.1950 11.1572 37.4491 29.7578 21.0409 3.7881 4.2259 15.5940 13.5480 10.1694 12.5221 262.8763 172.5436 18.1426 21.3943 45.2222 8.6607 20.5260 25.8179 1.9702 10.5800 22.0069 22.9015 5.8747 90.7413 51.3691 25.9912 8.3729 8.6093 10.5635 5.0653 9.4544
temp: 298.150 k
press: 1.00000 atm
elementType: 8 8 8 7 6 6 6 6 6 6 6 6 6 6 1 1 1 1 1 1 1 1 1 1 1 1 1 1 1 1 1 1 1
symmnumber: 1
zpe: 737178.1 jmol-1
zpe.correction: 0.280776 hartree
zpe.thermalcorrener: 0.297458 hartree
zpe.thermalcorrenthalpy: 0.298402 hartree
zpe.thermalcorrgfe: 0.233582 hartree
zpe.sumelectzpe: -671.767792 hartree
zpe.sumelectthermal: -671.751110 hartree
zpe.sumelectthermalent: -671.750166 hartree
zpe.sumelectthermalfe: -671.814986 hartree
dipole: -1.7083 -3.1640 2.7233
dipole: 4.5106
quadrupole: -81.3619 -98.8508 -85.8531
quadrupole: 1.0267 3.5927 -1.2937
quadrupole: 7.3267 -10.1621 2.8355 1.0267 3.5927 -1.2937
hfenergy: -672.0485681 hartree
pointgroup: C01 [X(C10H19N1O3)]
dipole: 0.8205285 -1.5587449 -0.2150686 debye
polarizability: 123.5952801|-0.1403875|132.9877706|-5.0435049|-15.0664211|115.9012492 unknown
InChI: InChI=1S/C10H19NO3/c1-4-5-6-11(9(2)12)7-8-14-10(3)13/h4-8H2,1-3H3
charge 0 multiplicity 1
33 atoms
O  -2.10808 -0.182549 -0.717045
O  0.299333 3.280841 -1.574085
O  -2.773562 -0.638036 1.474228
N  0.611083 1.193525 -0.61341
C  1.308399 -0.105344 -0.489229
C  2.385937 -0.128178 0.621802
C  -0.516611 1.471051 0.301323
C  3.051612 -1.515621 0.764023
C  -1.893488 1.25003 -0.344252
C  0.955308 2.189111 -1.523377
C  4.128722 -1.549099 1.869477
C  2.129469 1.922775 -2.465158
C  -2.575901 -1.025197 0.29925
C  -2.826145 -2.418217 -0.237278
H  0.548134 -0.882755 -0.284669
H  1.767252 -0.366717 -1.458753
H  1.924756 0.161306 1.587502
H  3.157015 0.637195 0.40139
H  -0.469559 2.53334 0.603564
H  -0.41749 0.84279 1.20272
H  3.505942 -1.807403 -0.20518
H  2.273187 -2.274793 0.984197
H  -1.971821 1.796227 -1.294989
H  -2.690234 1.558537 0.356073
H  3.694036 -1.294609 2.854176
H  4.590298 -2.549872 1.952572
H  4.935193 -0.821146 1.661252
H  2.357476 2.866457 -2.982174
H  3.032701 1.57473 -1.93357
H  1.865536 1.164625 -3.226136
H  -2.125122 -2.660652 -1.051066
H  -3.851179 -2.471516 -0.647803
H  -2.744997 -3.152131 0.578828
