program: Gaussian 09
title: 000249511
version: EM64L-G09RevD.01
frameworkgroup: C1[X(C12H24O2)]
method: RPBEPBE
basis: SDD
operation: Freq
keyword: #pfreq=noraman
keyword: PBEPBE/SDD
title: #p freq=noraman PBEPBE/SDD
converged: YES YES NO NO
title: Mulliken charges:
elementType: O O C C C C C C C C C C C C H H H H H H H H H H H H H H H H H H H H H H H H
charge: -0.439484 -0.447477 -0.044449 -0.150684 -0.476383 -0.484075 -0.431018 -0.408424 -0.041799 -0.394436 -0.376204 -0.355859 -0.356930 -0.697110 0.194992 0.238806 0.218555 0.189054 0.207933 0.212912 0.224165 0.214212 0.209045 0.188319 0.173379 0.217274 0.184871 0.193288 0.186309 0.318341 0.186305 0.190136 0.331803 0.194059 0.196014 0.214928 0.209240 0.210389
chargesum: 0.00000
title: Mulliken charges with hydrogens summed into heavy atoms:
elementType: O O C C C C C C C C C C C C
charge: -0.121143 -0.115674 0.150544 0.088122 -0.068774 -0.063230 0.007359 -0.011060 0.131580 0.007710 0.003394 0.020582 0.033143 -0.062552
polarizability: 1.68627835e+02 -1.31326061e-01 1.22655379e+02 2.06728748e+00 2.16986289e+00 1.13369564e+02
1716.lowfreq: -18.1711 -5.4589 -0.0010 0.0002 0.0006 9.2630 23.2836 39.7429 50.6340
frequency: 21.3446 39.4929 50.5682 62.4715 100.4494 118.1229 129.9533 136.1701 160.6959 203.2141 231.9149 237.1940 238.5066 258.8390 279.2562 308.5526 337.1609 354.5584 382.2641 436.6373 449.3515 485.5912 511.4717 573.9189 657.3000 718.2516 725.5115 744.8153 780.4224 815.3253 860.4891 877.9593 887.4047 891.6421 930.6032 962.9817 971.4023 1000.3465 1011.8772 1015.2624 1034.1955 1038.5301 1059.4849 1071.1935 1080.0121 1084.8611 1097.7054 1119.2968 1129.4404 1151.0806 1178.6395 1193.5397 1211.4576 1227.1318 1236.9950 1241.4792 1254.9071 1265.3903 1273.3772 1280.7873 1284.4772 1295.5808 1297.0710 1309.8142 1321.9259 1330.5844 1341.4632 1342.4428 1352.7397 1356.1806 1363.7831 1374.3085 1387.8575 1398.9224 1449.9667 1450.8755 1460.7944 1463.6965 1471.3597 1471.9035 1477.3682 1478.6856 1480.8390 1487.5254 2902.7107 2938.9537 2949.5435 2951.0299 2952.2730 2956.1572 2962.5276 2967.5261 2971.0265 2980.1352 2986.3898 2991.8533 2998.8935 3010.8899 3026.2695 3031.7456 3040.7978 3042.5217 3056.8489 3059.9198 3067.5839 3070.2137 3549.9923 3550.3822
redmass: 3.0434 1.9609 3.8560 3.1104 2.5360 2.1241 2.6191 3.0701 3.0127 4.1582 1.7858 1.1256 1.2679 2.5826 2.4858 1.2402 2.9976 3.2404 3.8145 2.5154 2.3213 3.3121 2.9019 2.6101 2.8704 1.2185 1.3201 1.6935 1.3294 1.8040 1.7367 1.8225 1.9082 1.6334 1.9962 2.4640 1.2888 4.4717 2.6483 3.0061 1.8452 1.3731 2.6943 1.7905 2.1485 1.8709 1.9413 2.1337 1.7903 1.5718 1.4608 1.6276 1.4565 1.3162 1.2785 1.3659 1.2783 1.4472 1.2478 1.1542 1.1045 1.2180 1.1678 1.3043 1.3543 1.3652 1.5027 1.4751 1.6654 1.5550 1.5188 1.1804 1.2172 1.6624 1.0885 1.0875 1.0688 1.0760 1.0817 1.0865 1.0436 1.0893 1.0821 1.0860 1.0829 1.0716 1.0589 1.0636 1.0737 1.0600 1.0618 1.0593 1.0366 1.0593 1.0960 1.0620 1.0973 1.1008 1.1021 1.0945 1.1027 1.1032 1.0871 1.1020 1.1007 1.0993 1.0657 1.0659
irintensity: 0.0318 0.0072 0.0143 0.0861 0.2743 0.1171 2.3680 5.2744 0.1666 1.2155 4.0754 22.0798 70.7758 18.6067 53.3525 125.0736 15.4747 1.0497 1.0630 0.6778 5.2351 5.8891 1.3119 7.7502 9.2241 6.5446 9.4235 3.1124 3.1987 9.2929 3.0493 19.6255 7.7881 3.9659 5.3438 50.0671 7.9914 18.7440 9.1760 69.5252 3.6268 4.5700 4.6611 26.9730 3.6310 6.9756 2.2802 5.6520 20.2136 27.6032 21.5603 1.7078 15.0111 0.8439 11.5702 5.3975 3.2323 3.5486 0.8262 0.0436 0.6164 0.3625 1.1711 2.8879 4.2826 0.1960 10.7204 2.7210 2.0360 3.0972 24.8940 12.6479 11.0310 2.3524 7.2161 1.8461 0.0759 0.1682 6.4310 11.0238 12.3119 4.0184 7.4047 21.2924 57.9861 11.2219 0.0810 7.8939 27.6910 5.1238 39.9841 147.0645 36.4034 32.9740 3.4506 28.7776 3.5032 2.4063 15.2567 13.5584 1.3426 180.1267 46.3624 42.0295 96.2532 56.6412 2.2003 2.6323
temp: 298.150 k
press: 1.00000 atm
elementType: 8 8 6 6 6 6 6 6 6 6 6 6 6 6 1 1 1 1 1 1 1 1 1 1 1 1 1 1 1 1 1 1 1 1 1 1 1 1
symmnumber: 1
zpe: 895136.6 jmol-1
zpe.correction: 0.340940 hartree
zpe.thermalcorrener: 0.357872 hartree
zpe.thermalcorrenthalpy: 0.358816 hartree
zpe.thermalcorrgfe: 0.295248 hartree
zpe.sumelectzpe: -620.947356 hartree
zpe.sumelectthermal: -620.930423 hartree
zpe.sumelectthermalent: -620.929479 hartree
zpe.sumelectthermalfe: -620.993048 hartree
dipole: 0.2095 0.3328 -0.0552
dipole: 0.3971
quadrupole: -96.9139 -88.0479 -89.0150
quadrupole: 5.9803 -5.3306 3.0792
quadrupole: -5.5883 3.2777 2.3106 5.9803 -5.3306 3.0792
hfenergy: -621.2882953 hartree
pointgroup: C01 [X(C12H24O2)]
dipole: 0.0821728 0.1302466 -0.0262455 debye
polarizability: 168.6407439|-0.0019756|122.786931|1.8886752|1.8649502|113.2251018 unknown
InChI: InChI=1S/C12H24O2/c1-2-3-4-5-6-10-7-8-11(13)9-12(10)14/h10-14H,2-9H2,1H3
charge 0 multiplicity 1
38 atoms
O  -1.300831 -1.215206 1.533874
O  -5.215318 -0.506914 -0.56648
C  -1.020864 0.54113 -0.252479
C  -1.420292 -0.924122 0.083912
C  -2.110483 1.533838 0.238731
C  -2.838863 -1.25863 -0.439035
C  -3.51433 1.18706 -0.311213
C  0.377168 0.918056 0.29767
C  -3.901264 -0.252331 0.05332
C  1.543861 0.082858 -0.276069
C  2.926176 0.570076 0.214423
C  4.101253 -0.269226 -0.335674
C  5.483078 0.209431 0.165781
C  6.651476 -0.633871 -0.389122
H  -0.988181 0.605434 -1.362707
H  -0.696235 -1.626699 -0.361832
H  -1.831799 2.560393 -0.065831
H  -2.130983 1.547906 1.351247
H  -3.100314 -2.287288 -0.12056
H  -2.835105 -1.237933 -1.547326
H  -4.278401 1.883683 0.07967
H  -3.523024 1.276623 -1.41533
H  0.367542 0.810396 1.400955
H  0.560717 1.991478 0.081406
H  -3.99924 -0.334749 1.16218
H  1.418561 -0.979201 0.013901
H  1.515584 0.116528 -1.386122
H  2.946778 0.544967 1.324082
H  3.067015 1.6327 -0.075628
H  -1.886266 -0.58997 2.032382
H  4.085856 -0.241887 -1.445682
H  3.958092 -1.332255 -0.049278
H  -5.47289 -1.449127 -0.396753
H  5.625316 1.272561 -0.11748
H  5.496985 0.179129 1.274508
H  7.627138 -0.273527 -0.013894
H  6.678551 -0.593849 -1.494653
H  6.547641 -1.695665 -0.095595
