program: Gaussian 09
title: 000249510
version: EM64L-G09RevD.01
frameworkgroup: C1[X(C11H14O3)]
method: RPBEPBE
basis: SDD
operation: Freq
keyword: #pfreq=noraman
keyword: PBEPBE/SDD
title: #p freq=noraman PBEPBE/SDD
converged: YES YES NO NO
title: Mulliken charges:
elementType: O O O C C C C C C C C C C C H H H H H H H H H H H H H H
charge: -0.461789 -0.259342 -0.268818 0.153695 -0.585762 0.380397 -0.704471 -0.391275 -0.400184 0.289567 -0.240299 -0.221389 -0.243656 -0.505667 0.263926 0.237446 0.245489 0.224935 0.210312 0.227634 0.278376 0.362970 0.223715 0.225292 0.227433 0.236309 0.250065 0.245092
chargesum: 0.00000
title: Mulliken charges with hydrogens summed into heavy atoms:
elementType: O O O C C C C C C C C C C C
charge: -0.098820 -0.259342 -0.268818 0.153695 -0.084390 0.380397 -0.023735 -0.163642 -0.121808 0.289567 -0.016584 0.003904 -0.016223 0.225799
polarizability: 1.26395970e+02 9.98001495e+00 1.28415191e+02 -1.38389302e+01 7.48358512e+00 1.11381741e+02
1716.lowfreq: -20.6384 -4.4547 -0.0002 -0.0001 0.0003 2.2891 29.5927 33.6596 67.6982
frequency: 29.0203 33.3436 67.6895 99.7276 133.6955 146.8169 170.9828 196.0103 230.1025 265.1471 271.3071 315.3977 334.1988 360.2738 404.0583 413.9198 478.7384 522.5972 558.2394 604.7443 610.6268 617.2705 690.4651 709.4198 722.1074 772.2973 823.7716 855.1037 858.5769 906.5183 928.5192 959.4427 969.1538 982.8751 989.5138 1002.0582 1023.2985 1055.0054 1072.9806 1081.9401 1114.0491 1127.6816 1150.2320 1161.8210 1171.8118 1188.1431 1196.0804 1271.3268 1309.3194 1316.6840 1367.1847 1377.5586 1384.3518 1422.6072 1431.3047 1435.6782 1452.9314 1455.0349 1462.9276 1469.7010 1480.2504 1588.9093 1610.4301 1614.3496 2992.2108 3009.6132 3011.8549 3091.8043 3097.3808 3103.7436 3114.8373 3118.8332 3127.6080 3140.1460 3154.6821 3155.6058 3166.2535 3397.3483
redmass: 3.9500 4.2986 5.7268 1.0949 3.5091 3.9147 2.9545 1.1905 3.6160 3.2028 3.8169 3.8552 5.2719 4.0870 2.8414 3.3249 3.5244 2.7307 3.2216 3.8160 1.4831 2.8325 5.0895 1.7460 4.8358 1.9191 4.2758 2.7434 1.4664 2.3430 1.4082 1.8123 4.0084 1.3797 5.9287 1.3204 2.4969 2.6129 1.7459 1.7178 1.2697 2.0984 1.4511 2.4257 1.0699 1.1329 2.0730 2.0312 1.4974 1.5714 1.4554 6.3195 1.2944 1.2045 1.9071 1.1976 1.0499 1.0640 1.0509 1.1299 1.9054 6.1496 6.1069 7.9167 1.0351 1.0302 1.0631 1.0990 1.0978 1.0996 1.1049 1.0846 1.0876 1.0933 1.0959 1.1053 1.0992 1.0656
irintensity: 0.2537 0.7515 0.3516 0.1363 1.4711 1.2545 0.9252 0.8730 7.5338 6.2803 8.5758 2.7642 8.2903 15.0357 0.5449 1.4982 6.6407 4.3268 20.7427 19.3020 143.3859 53.5788 1.5325 50.8385 3.8411 39.0760 12.9712 1.7258 1.6008 10.7526 2.9744 6.5376 22.3826 0.4443 0.1332 1.1023 10.2538 37.3265 12.6106 42.2429 0.0308 67.9923 2.0267 125.5972 5.5533 8.0058 89.8063 46.1953 30.0946 57.6420 97.3883 0.3496 26.4289 23.1047 4.5170 32.5876 14.3638 8.9724 11.0553 4.0016 15.1919 2.6635 4.3591 122.8755 19.7384 26.0791 8.2656 9.3478 30.5060 16.6471 22.2166 3.5636 3.9550 35.5492 19.3029 15.9014 16.1281 96.0224
temp: 298.150 k
press: 1.00000 atm
elementType: 8 8 8 6 6 6 6 6 6 6 6 6 6 6 1 1 1 1 1 1 1 1 1 1 1 1 1 1
symmnumber: 1
zpe: 595197.5 jmol-1
zpe.correction: 0.226699 hartree
zpe.thermalcorrener: 0.240864 hartree
zpe.thermalcorrenthalpy: 0.241808 hartree
zpe.thermalcorrgfe: 0.184797 hartree
zpe.sumelectzpe: -652.187199 hartree
zpe.sumelectthermal: -652.173034 hartree
zpe.sumelectthermalent: -652.172090 hartree
zpe.sumelectthermalfe: -652.229101 hartree
dipole: 1.4172 -2.3024 -1.9104
dipole: 3.3105
quadrupole: -74.4490 -80.5777 -83.5252
quadrupole: -1.4391 -3.0041 -3.0328
quadrupole: 5.0683 -1.0604 -4.0079 -1.4391 -3.0041 -3.0328
hfenergy: -652.4138978 hartree
pointgroup: C01[X(C11H14O3)]
dipole: -0.4583757 -0.8486604 0.8752232 debye
polarizability: 126.0199528|-11.9510842|125.4018123|-12.9958261|-9.0564753|114.7711371 unknown
InChI: InChI=1S/C11H14O3/c1-11(13,8-10(12)14-2)9-6-4-3-5-7-9/h3-7,13H,8H2,1-2H3
charge 0 multiplicity 1
28 atoms
O  -0.427403 2.056442 -1.261781
O  -2.697433 -0.951475 0.895156
O  -2.142366 -0.177101 -1.222611
C  -0.128897 1.563433 0.09493
C  -1.467923 1.116802 0.767886
C  0.910393 0.419845 0.048974
C  0.452838 2.781521 0.84118
C  1.081653 -0.483258 1.129906
C  1.764292 0.302941 -1.076275
C  -2.114453 -0.039759 0.029843
C  2.077257 -1.485558 1.082235
C  2.75951 -0.698201 -1.125624
C  2.920249 -1.598261 -0.046844
C  -3.373715 -2.112587 0.257164
H  -2.158049 1.981205 0.718689
H  -1.338285 0.85345 1.829218
H  1.352368 3.135601 0.310518
H  -0.284863 3.602994 0.860057
H  0.737053 2.518256 1.875076
H  0.442897 -0.414796 2.018234
H  1.630521 1.003563 -1.906657
H  -0.962039 1.345468 -1.719783
H  2.193156 -2.176762 1.925076
H  3.408678 -0.776379 -2.00538
H  3.691203 -2.376207 -0.084973
H  -3.799016 -2.681554 1.094977
H  -2.638147 -2.712851 -0.302978
H  -4.160275 -1.762374 -0.431614
