program: Gaussian 09
title: 000249507
version: EM64L-G09RevD.01
frameworkgroup: C1[X(C14H26O5)]
method: RPBEPBE
basis: SDD
operation: Freq
keyword: #pfreq=noraman
keyword: PBEPBE/SDD
title: #p freq=noraman PBEPBE/SDD
converged: YES YES NO NO
title: Mulliken charges:
elementType: O O O O O C C C C C C C C C C C C C C H H H H H H H H H H H H H H H H H H H H H H H H H H
charge: -0.247131 -0.276320 -0.225983 -0.238266 -0.295243 -0.138016 -0.437544 -0.380917 -0.081756 -0.356109 0.221824 -0.358534 -0.703580 -0.697456 -0.267040 0.329407 -0.663308 -0.270018 -0.663397 0.233394 0.234976 0.219489 0.181547 0.210546 0.262489 0.195539 0.188346 0.193442 0.197358 0.226318 0.217915 0.243726 0.209776 0.214857 0.211441 0.236889 0.221543 0.248915 0.225629 0.216682 0.226727 0.233408 0.247224 0.234556 0.216660
chargesum: 0.00000
title: Mulliken charges with hydrogens summed into heavy atoms:
elementType: O O O O O C C C C C C C C C C C C C C
charge: -0.247131 -0.276320 -0.225983 -0.238266 -0.295243 0.095378 0.016921 0.011176 0.180733 0.027776 0.221824 0.032266 -0.015622 -0.061383 0.191392 0.329407 0.027919 0.190116 0.035042
polarizability: 1.82954327e+02 -1.48716476e+01 1.81697621e+02 2.74527406e+00 -5.45971660e+00 1.46366275e+02
1716.lowfreq: -7.6156 0.0003 0.0007 0.0009 3.6051 8.4890 13.3484 23.0581 25.8473
frequency: 12.4895 22.9816 25.7556 36.9459 49.9859 55.9003 63.5591 76.5308 83.8714 85.6950 104.6362 114.9951 133.0382 144.4265 152.0952 168.1071 193.8280 205.9370 217.9227 225.3522 225.9867 252.5211 260.7826 311.9350 325.3047 334.6759 375.9152 393.9166 411.8361 456.0583 489.6897 512.1462 539.6357 619.3780 645.9642 691.9188 725.4937 738.0895 745.6569 774.1815 794.7723 801.4916 816.0631 832.6283 835.4522 869.6584 892.7374 921.1323 960.1698 968.8835 996.1574 1010.7708 1020.4267 1034.7379 1049.2166 1069.2235 1075.6165 1086.4255 1094.9464 1096.8067 1101.4081 1127.9687 1133.5764 1156.3785 1158.6427 1160.1942 1192.5159 1205.0698 1232.5581 1260.3836 1265.0554 1278.6578 1279.2786 1286.0944 1292.1858 1301.1137 1317.4539 1330.4101 1350.4747 1353.3447 1358.2805 1359.5898 1379.5651 1388.2296 1389.7885 1391.1816 1398.1961 1456.6757 1457.3768 1457.9387 1459.1200 1462.4547 1463.5588 1463.7986 1470.0336 1472.6673 1475.4164 1478.9630 1484.6781 1484.9878 1487.9949 1616.0741 1643.4099 2952.3428 2956.4674 2967.4403 2971.0981 2989.2001 2992.4788 2992.7784 2992.9580 3000.0644 3002.4472 3009.2638 3023.8586 3029.5171 3031.1763 3031.4365 3058.8379 3067.8917 3070.0848 3087.3307 3088.2248 3092.5699 3095.3270 3097.7083 3111.4295 3118.5759 3121.6661
redmass: 4.2936 3.9556 4.0086 3.8456 2.8592 1.9159 2.5021 4.7671 3.8381 4.5825 3.9191 2.8503 1.8077 3.3258 2.1482 3.3349 1.2566 1.3799 3.6184 1.2072 1.3530 1.7940 3.0634 2.9558 3.3335 3.3443 3.8336 3.8346 3.5406 3.2487 3.6775 3.9907 3.5929 3.6411 5.8678 12.3175 1.0829 3.2392 1.3119 2.6727 2.1678 1.3632 1.4845 2.6772 1.9910 1.9887 1.8890 2.2779 1.8518 1.6808 2.5939 2.4632 2.5209 2.4329 4.8288 2.2808 2.1853 3.2836 2.1186 2.1486 2.0170 2.3302 2.2840 1.8798 1.8310 2.0193 4.1555 1.6315 1.2414 1.3580 1.3323 1.1157 1.1188 1.1553 1.1683 1.1843 1.3110 1.3411 1.3586 1.4164 1.3833 1.4526 1.4054 1.2198 1.2345 1.2329 1.2335 1.0476 1.0946 1.0895 1.0704 1.0554 1.0733 1.0475 1.0741 1.0521 1.0429 1.0745 1.0540 1.0519 1.0866 8.7363 9.0606 1.0594 1.0599 1.0595 1.0366 1.0700 1.0361 1.0870 1.0365 1.0601 1.0576 1.0993 1.0861 1.0594 1.1022 1.0615 1.1030 1.1007 1.0993 1.0975 1.0976 1.1033 1.1020 1.0998 1.0997 1.1061 1.1064
irintensity: 0.2936 0.4366 0.6214 0.0579 0.6948 0.3702 1.8302 1.3836 1.0973 0.1603 1.1825 0.5360 0.2664 0.9830 3.5577 0.1306 0.9672 2.7502 1.3425 0.8323 3.0804 0.7946 1.8905 27.6753 8.4983 0.9056 3.0516 8.7719 3.7549 0.9327 0.1714 10.0663 2.5166 0.7373 2.4590 21.3098 13.4088 11.3242 0.0867 9.1866 29.0335 7.2828 3.8556 6.7500 3.6043 14.9354 9.0138 5.7361 24.7413 20.0217 58.6506 64.6187 49.2777 31.7688 7.7402 21.6007 7.0017 300.6210 67.5700 3.7651 93.9174 107.8702 84.7550 5.3821 62.5975 16.4739 622.3276 20.9227 15.0979 9.1060 10.5914 5.4228 3.8124 10.1761 4.7260 5.0894 1.3642 8.7509 3.3622 1.1076 2.4820 4.3258 4.0865 11.5561 22.4453 22.4459 20.7610 12.9928 16.8660 12.0324 9.8805 11.9773 2.9096 12.4964 3.5461 11.1993 12.3944 5.4326 21.5238 11.0529 18.5112 191.0646 130.0197 1.3440 12.0201 84.2313 36.1234 16.5966 18.6105 14.3663 16.8248 5.1179 21.4507 4.2466 11.9866 31.5939 38.0411 30.8300 27.0488 97.1803 56.2836 36.4487 35.3726 1.4912 3.4749 27.3946 20.7172 33.5341 31.9318
temp: 298.150 k
press: 1.00000 atm
elementType: 8 8 8 8 8 6 6 6 6 6 6 6 6 6 6 6 6 6 6 1 1 1 1 1 1 1 1 1 1 1 1 1 1 1 1 1 1 1 1 1 1 1 1 1 1
symmnumber: 1
zpe: 1007658.7 jmol-1
zpe.correction: 0.383797 hartree
zpe.thermalcorrener: 0.407794 hartree
zpe.thermalcorrenthalpy: 0.408738 hartree
zpe.thermalcorrgfe: 0.326060 hartree
zpe.sumelectzpe: -923.671314 hartree
zpe.sumelectthermal: -923.647317 hartree
zpe.sumelectthermalent: -923.646373 hartree
zpe.sumelectthermalfe: -923.729051 hartree
dipole: 0.8725 -0.5601 0.8380
dipole: 1.3331
quadrupole: -102.5017 -108.6663 -118.6826
quadrupole: -9.1266 3.7328 -3.6475
quadrupole: 7.4485 1.2839 -8.7324 -9.1266 3.7328 -3.6475
hfenergy: -924.055111 hartree
pointgroup: C01 [X(C14H26O5)]
dipole: -0.3003445 -0.2696312 -0.3349446 debye
polarizability: 175.8312527|13.7553045|187.6532038|0.5177348|8.6861988|147.5337663 unknown
InChI: InChI=1S/C14H26O5/c1-5-8-9-10-12(13(15)17-6-2)11(4)19-14(16)18-7-3/h11-12H,5-10H2,1-4H3
charge 0 multiplicity 1
45 atoms
O  1.995936 -0.811956 -0.382747
O  -1.283121 -3.01554 -0.35242
O  -0.709395 -1.583003 1.397304
O  3.56161 0.398048 0.631087
O  2.626167 1.241798 -1.352588
C  -0.429369 -0.842808 -0.958821
C  -0.652872 0.624075 -0.514316
C  -2.143584 0.985552 -0.331587
C  1.016118 -1.077444 -1.492266
C  -2.350253 2.453171 0.104392
C  -0.798227 -1.807757 0.17057
C  -3.838666 2.835067 0.27131
C  1.321572 -2.48878 -1.997461
C  -4.038844 4.301888 0.709432
C  -1.692415 -4.056431 0.643598
C  2.711416 0.367418 -0.456166
C  -3.146731 -3.846765 1.074752
C  4.392585 1.637166 0.757407
C  3.600705 2.756922 1.436106
H  -1.093161 -1.081956 -1.813606
H  -0.117581 0.787522 0.440265
H  -0.196296 1.296587 -1.266341
H  -2.688945 0.806969 -1.282662
H  -2.596949 0.316031 0.427179
H  1.201352 -0.323548 -2.280978
H  -1.817952 2.627206 1.062578
H  -1.880506 3.129369 -0.640558
H  -4.369915 2.658886 -0.686678
H  -4.30632 2.158241 1.01528
H  2.331568 -2.521213 -2.440813
H  0.586624 -2.786446 -2.766001
H  1.273429 -3.224672 -1.178718
H  -3.60443 4.999468 -0.031586
H  -5.110666 4.550111 0.819279
H  -3.545676 4.496042 1.680682
H  -1.006545 -4.005272 1.507348
H  -1.553906 -5.005201 0.100653
H  -3.257902 -2.896084 1.62251
H  -3.820114 -3.838369 0.200239
H  -3.459859 -4.669043 1.744748
H  5.245089 1.30293 1.369289
H  4.736873 1.936744 -0.248116
H  2.762792 3.08795 0.799533
H  3.202964 2.420835 2.408976
H  4.2622 3.625297 1.613413
