program: Gaussian 09
title: 000249506
version: EM64L-G09RevD.01
frameworkgroup: C1[X(C10H18O4)]
method: RPBEPBE
basis: SDD
operation: Freq
keyword: #pfreq=noraman
keyword: PBEPBE/SDD
title: #p freq=noraman PBEPBE/SDD
converged: YES YES NO NO
title: Mulliken charges:
elementType: O O O O C C C C C C C C C C H H H H H H H H H H H H H H H H H H
charge: -0.468741 -0.256154 -0.267868 -0.431682 0.188107 -0.456618 -0.456705 -0.386068 -0.383930 -0.388853 0.174796 -0.285456 -0.390879 -0.317535 0.227788 0.213086 0.208420 0.233773 0.197725 0.223613 0.213136 0.199865 0.205012 0.187065 0.356481 0.226532 0.230062 0.234085 0.229347 0.215278 0.190026 0.336292
chargesum: 0.00000
title: Mulliken charges with hydrogens summed into heavy atoms:
elementType: O O O O C C C C C C C C C C
charge: -0.112260 -0.256154 -0.267868 -0.095390 0.188107 -0.015744 -0.014511 0.035270 0.029072 0.003224 0.174796 0.171138 0.072553 0.087769
polarizability: 1.36719136e+02 1.38747118e+00 1.17020244e+02 -8.94414140e-01 1.31214124e+00 1.02829851e+02
1716.lowfreq: -6.3465 -0.0006 -0.0005 -0.0002 8.3653 13.4357 25.8642 45.1068 50.2222
frequency: 25.5301 45.0865 50.2019 77.2181 100.0472 124.7854 151.2082 184.0336 211.4690 250.7562 274.7719 298.0478 325.4697 331.9053 345.4694 365.3978 389.3408 412.1463 451.0193 456.3964 492.4508 559.3025 584.7915 713.2705 735.4172 778.5360 787.4627 812.6967 850.1757 874.5911 881.1820 906.9076 925.1213 938.3402 953.8261 977.1796 1035.5398 1044.4445 1048.6731 1057.4031 1073.3232 1091.6350 1102.2235 1124.6424 1135.2271 1166.1166 1185.1944 1196.7537 1250.1937 1258.0171 1260.1684 1267.3918 1285.8540 1294.9289 1312.9479 1337.1906 1338.1908 1341.5354 1346.5326 1347.3110 1372.9672 1381.7686 1389.1524 1456.0576 1458.7447 1463.9091 1465.5678 1471.6925 1472.4681 1479.8086 1487.1219 1591.5817 2954.6736 2966.3233 2983.2020 2990.1849 2991.4693 2998.8966 3002.2346 3025.0899 3031.9297 3038.3284 3048.3922 3053.7009 3057.0937 3064.9589 3076.6213 3107.2272 3469.1012 3561.7283
redmass: 5.1103 5.0247 6.5147 1.8502 3.4334 2.9192 3.3249 2.9634 3.4915 2.1311 3.1501 3.8184 1.2433 1.8553 2.5144 2.8158 2.0280 3.9627 3.2862 2.4221 2.5532 3.8473 2.8014 6.5952 3.2797 1.4512 1.1704 2.3677 1.8745 2.4724 1.5907 2.3384 2.9255 1.4114 2.6793 4.3322 3.9595 3.6908 1.8821 3.1488 1.4435 1.5009 1.4829 2.9973 1.9310 2.6115 1.4093 1.6881 1.3279 1.3478 1.3007 1.2573 1.1736 1.0851 1.3436 1.4719 1.3669 1.2724 1.4369 1.4502 1.4282 1.4895 1.2507 1.1100 1.0801 1.0890 1.0844 1.0810 1.0768 1.0937 1.0909 8.5982 1.0684 1.0628 1.0595 1.0616 1.0619 1.0632 1.0608 1.0591 1.0964 1.1020 1.1012 1.1030 1.0947 1.1018 1.1017 1.1081 1.0648 1.0663
irintensity: 2.2492 0.0621 0.5756 5.9693 2.0353 1.3248 3.3936 0.9312 3.3916 4.3554 2.7915 7.6704 180.4469 83.5919 13.9969 11.6901 35.3881 13.6519 10.4128 13.9531 2.1755 9.3703 1.3043 10.4781 10.6137 1.0666 3.6800 3.9623 16.5166 18.6236 8.5141 12.0700 30.5543 2.9968 46.8117 55.6982 90.5975 30.6287 0.2744 19.8301 5.8686 30.3216 0.2846 118.2638 16.6204 180.9609 21.9005 4.7131 40.3013 3.1314 18.5016 8.7777 6.0023 3.0017 0.0288 0.5033 3.0064 6.4481 1.9320 4.0959 8.0939 12.5062 25.0758 16.1237 4.5291 4.2506 15.2921 22.3420 2.7904 9.7389 10.5308 153.4511 61.6223 37.1648 17.3890 19.7277 54.6530 28.6145 9.7998 35.1079 54.4234 40.1755 12.3152 21.9926 11.5865 79.7965 23.0850 26.0379 31.2250 8.6454
temp: 298.150 k
press: 1.00000 atm
elementType: 8 8 8 8 6 6 6 6 6 6 6 6 6 6 1 1 1 1 1 1 1 1 1 1 1 1 1 1 1 1 1 1
symmnumber: 1
zpe: 714499.5 jmol-1
zpe.correction: 0.272138 hartree
zpe.thermalcorrener: 0.287443 hartree
zpe.thermalcorrenthalpy: 0.288387 hartree
zpe.thermalcorrgfe: 0.228633 hartree
zpe.sumelectzpe: -691.614371 hartree
zpe.sumelectthermal: -691.599067 hartree
zpe.sumelectthermalent: -691.598122 hartree
zpe.sumelectthermalfe: -691.657877 hartree
dipole: 0.1342 -1.3608 -1.5989
dipole: 2.1038
quadrupole: -94.4043 -89.7605 -83.3232
quadrupole: 9.8117 -1.2522 1.0620
quadrupole: -5.2416 -0.5978 5.8394 9.8117 -1.2522 1.0620
hfenergy: -691.8865096 hartree
pointgroup: C01 [X(C10H18O4)]
dipole: -0.0125733 -0.1518459 -0.8135731 debye
polarizability: 136.6349001|1.526858|112.290917|-2.1148161|6.6960229|107.6434133 unknown
InChI: InChI=1S/C10H18O4/c11-7-4-8-14-9(12)10(13)5-2-1-3-6-10/h11,13H,1-8H2
charge 0 multiplicity 1
32 atoms
O  -1.67869 1.711257 1.960697
O  0.382684 -0.067847 -0.500285
O  0.609364 1.97399 0.587473
O  5.280779 -0.75612 0.193967
C  -1.49547 0.732468 0.874644
C  -1.741168 -0.660598 1.509101
C  -2.54229 1.027173 -0.246412
C  -1.974445 -1.808749 0.499716
C  -2.729594 -0.12626 -1.25909
C  -3.069652 -1.448064 -0.531951
C  -0.068238 0.943334 0.329304
C  1.752932 0.110855 -1.083525
C  2.830925 -0.362567 -0.099122
C  4.242174 -0.254232 -0.715031
H  -2.644892 -0.529795 2.135669
H  -0.911151 -0.901015 2.199029
H  -2.282526 1.97363 -0.759446
H  -3.492589 1.206002 0.293146
H  -2.262155 -2.719657 1.059661
H  -1.033242 -2.037062 -0.032661
H  -1.808542 -0.262723 -1.857905
H  -3.538253 0.14384 -1.965334
H  -3.18542 -2.269031 -1.265369
H  -4.044752 -1.337897 -0.012958
H  -1.01569 2.443019 1.823547
H  1.727137 -0.507707 -1.995508
H  1.885053 1.176389 -1.3452
H  2.644843 -1.413986 0.185975
H  2.777568 0.254546 0.818361
H  4.330916 -0.897685 -1.607217
H  4.451735 0.794736 -1.018822
H  5.290153 -0.19854 1.012848
