program: Gaussian 09
title: 000249502
version: EM64L-G09RevD.01
frameworkgroup: C1[X(C13H20O)]
method: RPBEPBE
basis: SDD
operation: Freq
keyword: #pfreq=noraman
keyword: PBEPBE/SDD
title: #p freq=noraman PBEPBE/SDD
converged: YES YES NO NO
title: Mulliken charges:
elementType: O C C C C C C C C C C C C C H H H H H H H H H H H H H H H H H H H H
charge: -0.459264 -0.365740 -0.438126 -0.377830 -0.226899 -0.363839 -0.369783 0.491190 -0.693656 -0.377564 -0.433672 -0.226927 -0.234510 -0.241158 0.180551 0.222435 0.226705 0.182031 0.199278 0.192704 0.195087 0.186309 0.199628 0.201313 0.194449 0.214599 0.207463 0.218718 0.263165 0.229034 0.331884 0.222509 0.223889 0.226026
chargesum: 0.00000
title: Mulliken charges with hydrogens summed into heavy atoms:
elementType: O C C C C C C C C C C C C C
charge: -0.127380 0.037246 -0.029390 0.014152 -0.031812 0.022098 0.025979 0.491190 -0.052877 -0.114398 -0.204638 -0.004417 -0.010621 -0.015132
polarizability: 1.52210639e+02 -1.92822581e+01 1.42255917e+02 1.46626605e+01 7.16106555e+00 1.22263661e+02
1716.lowfreq: -0.0006 -0.0005 -0.0005 6.3657 12.3281 21.2263 28.1285 33.4373 42.3261
frequency: 27.9727 32.4083 41.6098 76.5117 94.7208 110.3974 137.1008 163.9232 184.3692 214.3196 251.0663 259.5773 297.9319 305.6258 365.6958 382.1155 403.2898 464.1079 503.9272 550.5738 591.7778 616.9663 704.4408 724.4639 738.0648 765.9942 770.6248 801.6695 854.9461 868.3389 894.0959 922.7154 945.8455 975.1849 977.1540 989.5146 992.1434 994.9441 1015.7003 1027.3701 1033.0465 1073.4639 1078.6673 1097.5547 1110.8993 1118.6068 1162.3248 1171.4388 1176.4984 1184.2683 1213.7546 1234.9055 1244.2812 1270.4673 1285.8033 1291.0785 1300.0848 1316.2068 1319.9844 1339.2561 1349.3231 1360.4052 1380.6135 1388.5002 1397.4662 1441.3339 1453.7645 1460.4987 1467.4229 1469.7400 1479.4060 1484.2076 1486.0604 1488.2648 1595.7862 1615.9320 2935.2567 2946.0775 2953.0857 2955.5427 2965.7803 2967.2019 2975.8523 2996.4580 3011.1314 3018.9273 3027.5789 3046.0243 3068.5009 3077.1103 3113.5110 3124.7417 3138.2477 3154.3820 3165.9896 3555.4648
redmass: 3.7709 2.4389 4.0066 2.9088 3.2824 1.7760 2.1241 2.2801 2.2710 3.9403 1.5222 2.7351 1.3393 2.3012 3.6249 3.2740 2.8303 2.6803 3.5182 2.9128 3.8488 6.3851 1.7572 1.1252 1.5795 1.4438 2.0190 1.4847 1.2476 2.4432 1.3352 1.4494 3.0552 2.9059 1.4243 3.5969 1.6126 1.3566 2.1630 2.0791 3.3886 2.2505 1.6064 2.4462 1.7460 1.8909 1.5275 1.0685 1.6263 1.1367 1.4593 1.2957 1.3501 1.2080 1.1795 1.1026 1.1399 1.3079 1.2813 1.4828 1.4549 1.5908 4.1515 1.2199 1.9570 2.0820 1.1115 1.0710 1.0695 1.0902 1.0512 1.2376 1.8712 1.0722 6.1746 6.1628 1.0840 1.0639 1.0596 1.0620 1.0605 1.0622 1.0372 1.0949 1.0955 1.0992 1.1017 1.1032 1.0994 1.0994 1.0867 1.0869 1.0926 1.0962 1.0994 1.0659
irintensity: 0.0800 0.0332 0.2152 0.6176 0.2371 0.0504 1.2251 4.9076 0.2099 2.5498 0.2650 18.2247 116.6988 11.9427 3.7615 1.7007 0.4587 0.7099 7.3171 11.9596 14.5091 0.4167 56.6841 12.3773 4.7697 8.3873 60.7465 0.8227 0.0507 2.9064 7.2511 10.9476 24.0551 39.1531 2.4962 0.4177 2.3547 0.4149 6.2771 4.6358 7.6187 0.3753 8.3625 1.1368 0.9195 5.0982 59.8900 2.4185 13.2069 6.3960 14.4699 1.4343 1.7462 0.0206 2.5047 0.2414 1.6796 11.6178 2.6666 1.9786 0.6685 0.2049 6.6222 17.3801 15.0510 12.8021 1.7009 2.0524 4.1604 0.2249 10.2893 1.3006 11.2342 22.0388 0.4728 3.0789 39.7238 40.2324 8.2816 1.6180 91.8758 37.1753 31.7855 5.1514 11.3655 30.1669 7.1008 137.2745 62.6575 68.0797 9.7648 1.5745 32.8330 29.3080 13.1089 5.8942
temp: 298.150 k
press: 1.00000 atm
elementType: 8 6 6 6 6 6 6 6 6 6 6 6 6 6 1 1 1 1 1 1 1 1 1 1 1 1 1 1 1 1 1 1 1 1
symmnumber: 1
zpe: 781026.2 jmol-1
zpe.correction: 0.297477 hartree
zpe.thermalcorrener: 0.312874 hartree
zpe.thermalcorrenthalpy: 0.313818 hartree
zpe.thermalcorrgfe: 0.253055 hartree
zpe.sumelectzpe: -581.507682 hartree
zpe.sumelectthermal: -581.492285 hartree
zpe.sumelectthermalent: -581.491341 hartree
zpe.sumelectthermalfe: -581.552104 hartree
dipole: -2.1654 -0.1392 -0.3603
dipole: 2.1996
quadrupole: -93.5399 -81.6649 -83.2144
quadrupole: -7.7325 2.9315 0.3290
quadrupole: -7.4002 4.4749 2.9253 -7.7325 2.9315 0.3290
hfenergy: -581.805159 hartree
pointgroup: C01 [X(C13H20O1)]
dipole: 0.8519461 0.0696839 -0.1350481 debye
polarizability: 152.7705992|-18.533182|142.398692|-15.2027805|-6.5908408|121.5609258 unknown
InChI: InChI=1S/C13H20O/c1-2-3-4-8-11-13(14)12-9-6-5-7-10-12/h5-7,9-10,13-14H,2-4,8,11H2,1H3
charge 0 multiplicity 1
34 atoms
O  -1.635623 -2.798984 -0.215792
C  1.284776 -0.251043 -0.411949
C  0.432294 -1.447933 0.061687
C  2.678442 -0.203503 0.255058
C  -0.951389 -1.555682 -0.635782
C  3.530806 0.991855 -0.229378
C  4.902342 1.124811 0.478189
C  -1.88179 -0.402651 -0.286446
C  5.869667 -0.048821 0.201034
C  -2.617338 -0.418562 0.92496
C  -1.992264 0.718767 -1.144003
C  -3.441309 0.673721 1.274472
C  -2.811888 1.81616 -0.793053
C  -3.537755 1.797745 0.419803
H  1.411648 -0.298831 -1.514773
H  0.743622 0.692107 -0.201046
H  0.268761 -1.390258 1.155869
H  0.995323 -2.387339 -0.133879
H  3.212539 -1.153947 0.052325
H  2.555619 -0.141787 1.356788
H  -0.787448 -1.572723 -1.736588
H  3.693168 0.904884 -1.324549
H  2.952494 1.925862 -0.073076
H  5.381826 2.070089 0.153866
H  4.739083 1.217017 1.571638
H  6.852395 0.124075 0.677228
H  6.038174 -0.172135 -0.885933
H  5.474476 -1.004395 0.59102
H  -2.557866 -1.303548 1.566317
H  -1.442639 0.73285 -2.093752
H  -1.00573 -3.555899 -0.327508
H  -4.01292 0.647674 2.209443
H  -2.889681 2.677375 -1.466452
H  -4.178115 2.644551 0.691962
