program: Gaussian 09
title: 000249496
version: EM64L-G09RevD.01
frameworkgroup: C1[X(C16H22O4)]
method: RPBEPBE
basis: SDD
operation: Freq
keyword: #pfreq=noraman
keyword: PBEPBE/SDD
title: #p freq=noraman PBEPBE/SDD
converged: YES YES NO NO
title: Mulliken charges:
elementType: O O O O C C C C C C C C C C C C C C C C H H H H H H H H H H H H H H H H H H H H H H
charge: -0.283765 -0.299283 -0.250335 -0.243902 0.051457 0.069793 -0.391051 -0.377079 -0.721196 -0.709162 0.180040 0.152714 -0.704693 -0.690295 0.174630 0.182324 -0.371314 -0.342087 -0.221173 -0.224475 0.235874 0.223791 0.195050 0.215297 0.207443 0.194227 0.254598 0.253223 0.204378 0.216807 0.254287 0.215813 0.217825 0.245887 0.210632 0.238600 0.211591 0.214481 0.269828 0.264971 0.238072 0.236182
chargesum: 0.00000
title: Mulliken charges with hydrogens summed into heavy atoms:
elementType: O O O O C C C C C C C C C C C C C C C C
charge: -0.283765 -0.299283 -0.250335 -0.243902 0.287331 0.293584 0.019296 0.024591 -0.008997 -0.022256 0.180040 0.152714 -0.030348 -0.025624 0.174630 0.182324 -0.101487 -0.077116 0.016898 0.011707
polarizability: 2.12768964e+02 -8.83223590e+00 2.14926420e+02 -1.17357961e+00 1.70971570e+01 1.36327899e+02
1716.lowfreq: -5.3596 0.0001 0.0004 0.0006 3.5734 8.5535 24.8049 38.2647 43.6358
frequency: 24.7675 38.2264 43.6335 53.9706 63.0176 80.4648 82.0881 105.6107 111.3554 119.0473 144.5395 169.4185 188.4800 195.8099 209.7247 213.7776 216.6174 241.2314 254.7948 268.1759 279.7777 321.4471 347.5237 379.3839 381.7272 407.0809 419.6886 432.3768 482.7994 517.8865 533.3240 570.1664 639.4611 666.4312 677.2723 705.0474 744.8476 751.6836 777.2986 786.6955 789.8659 806.7229 818.3368 825.9752 859.1834 870.3463 903.3836 964.4141 966.4128 976.0275 992.9516 993.5133 1003.2141 1011.6071 1028.7623 1034.4798 1036.9456 1082.5189 1107.5996 1109.6676 1119.8065 1127.9586 1141.4913 1166.9613 1176.8953 1179.0069 1227.5680 1243.1534 1263.2869 1270.4579 1276.8582 1295.8086 1321.4280 1332.5103 1335.9139 1356.1989 1357.5222 1380.4922 1383.1966 1388.4886 1390.4887 1391.9361 1428.2581 1452.4433 1455.0343 1459.9902 1465.5477 1473.6987 1475.6565 1477.5388 1480.0849 1484.8426 1488.9091 1496.1495 1577.0907 1600.8223 1610.6741 1617.4243 2981.6153 2983.2077 2984.6843 2987.6076 2989.4710 2997.3976 3012.5034 3017.2479 3038.8620 3040.1200 3075.4360 3077.3846 3084.5668 3091.5665 3092.9800 3094.1729 3100.8348 3117.2004 3136.9696 3152.4022 3166.8152 3177.8766
redmass: 3.8123 3.2182 3.8294 3.9035 3.7126 3.8822 4.5480 2.3804 3.3890 3.1025 2.8435 2.6481 2.5499 1.1982 1.2034 2.0972 1.5299 2.4910 3.3752 1.8346 4.1487 4.2084 4.6241 3.2070 3.3726 3.6678 3.0091 3.5181 3.0413 3.8313 4.3187 3.0927 6.4065 5.9417 7.0334 3.8187 2.0357 1.8782 2.7896 2.3280 1.9440 2.9065 1.9368 3.2452 2.6756 2.6124 1.4606 1.8636 1.2864 1.4023 1.4001 1.5553 1.3534 1.3385 6.4789 3.4209 3.4039 3.3369 1.8218 1.8453 1.8829 2.2129 1.8009 1.9870 1.0619 2.0067 3.2188 2.4631 1.2732 1.1467 1.5022 1.3175 1.8490 1.2909 1.3954 1.3619 1.7000 10.2534 1.2269 1.2432 1.2143 1.2117 2.2034 1.0753 1.0703 1.0581 1.0598 1.0459 2.0468 1.1553 1.0596 1.0573 1.0530 1.0512 7.4080 7.0186 10.1602 10.4483 1.0404 1.0556 1.0515 1.0410 1.0408 1.0384 1.0864 1.0846 1.1001 1.0993 1.0995 1.0995 1.0987 1.1001 1.0993 1.0979 1.1005 1.1003 1.0862 1.0910 1.0958 1.0984
irintensity: 0.3738 0.0453 0.3877 0.1412 2.8993 0.4164 1.6168 0.5605 2.0288 0.7184 0.2545 0.9194 1.5123 0.1371 0.3928 2.3627 1.5343 6.1281 0.6087 0.5473 6.3982 3.1754 4.0708 3.9629 1.5662 3.4442 0.7650 2.5486 1.3781 1.0230 2.6224 4.7137 4.1139 3.8851 0.7953 67.3757 1.8183 3.7886 3.0429 15.6853 33.4417 15.2863 9.6049 8.6964 25.9850 16.1210 1.0658 19.4831 4.7740 2.9439 37.4714 1.5508 1.8705 18.1405 168.3502 77.3526 53.9461 268.1222 35.1370 4.5205 23.1834 11.5340 34.5548 10.5035 0.3963 22.6557 156.4844 305.0071 27.9159 5.4669 31.7912 0.8372 6.1514 5.0859 2.2667 0.0501 3.6280 12.2906 21.9863 23.4103 20.4287 26.8225 7.8437 2.7145 7.6276 6.4792 11.5486 5.6049 33.2596 13.5400 14.2053 16.6190 13.8281 4.0788 36.3844 92.0449 112.6517 126.9767 45.5962 20.6986 9.4044 21.1951 37.7927 21.0580 8.0394 32.5213 15.1188 13.6301 47.8935 51.0422 30.4307 47.4744 13.2281 59.8463 19.8449 13.2342 2.1348 9.5235 11.4500 14.6891
temp: 298.150 k
press: 1.00000 atm
elementType: 8 8 8 8 6 6 6 6 6 6 6 6 6 6 6 6 6 6 6 6 1 1 1 1 1 1 1 1 1 1 1 1 1 1 1 1 1 1 1 1 1 1
symmnumber: 1
zpe: 911561.1 jmol-1
zpe.correction: 0.347195 hartree
zpe.thermalcorrener: 0.369114 hartree
zpe.thermalcorrenthalpy: 0.370058 hartree
zpe.thermalcorrgfe: 0.295244 hartree
zpe.sumelectzpe: -922.293930 hartree
zpe.sumelectthermal: -922.272012 hartree
zpe.sumelectthermalent: -922.271068 hartree
zpe.sumelectthermalfe: -922.345882 hartree
dipole: -2.9784 -0.7762 -1.9877
dipole: 3.6639
quadrupole: -114.6709 -101.3341 -124.8407
quadrupole: -1.9767 -7.9663 1.5856
quadrupole: -1.0557 12.2811 -11.2254 -1.9767 -7.9663 1.5856
hfenergy: -922.6411256 hartree
pointgroup: C01 [X(C16H22O4)]
dipole: -1.1766112 0.1461011 -0.8198656 debye
polarizability: 206.006158|-3.7046154|224.1215616|7.8508496|4.7401278|133.8955636 unknown
InChI: InChI=1S/C16H22O4/c1-5-11(3)19-15(17)13-9-7-8-10-14(13)16(18)20-12(4)6-2/h7-12H,5-6H2,1-4H3
charge 0 multiplicity 1
42 atoms
O  1.856792 0.457176 -0.36254
O  -2.070051 0.129914 -0.04112
O  3.234148 -0.888386 0.958824
O  -0.352559 0.620472 1.463075
C  2.823633 1.61318 -0.228902
C  -2.792751 1.393784 0.35792
C  2.570784 2.498669 -1.461046
C  -3.662327 1.769291 -0.850785
C  2.60813 2.290272 1.132571
C  -3.588614 1.122906 1.642307
C  1.08633 -1.741785 0.182675
C  -0.313303 -1.471315 0.184117
C  1.167439 3.138265 -1.52561
C  -2.845946 2.126592 -2.109621
C  2.155236 -0.696861 0.343824
C  -0.862664 -0.140349 0.605904
C  1.538816 -3.066726 -0.030286
C  -1.22302 -2.525381 -0.085025
C  0.624921 -4.112117 -0.279644
C  -0.760704 -3.836743 -0.322369
H  3.841367 1.179253 -0.274905
H  -2.017067 2.161708 0.543993
H  3.34758 3.289624 -1.4638
H  2.739031 1.883646 -2.365852
H  -4.348781 0.927847 -1.067621
H  -4.294623 2.628772 -0.550628
H  1.546366 2.541024 1.286183
H  2.923662 1.621358 1.949792
H  3.210465 3.216202 1.185943
H  -4.331371 0.321341 1.479926
H  -2.916804 0.829504 2.466196
H  -4.127971 2.037377 1.950409
H  0.99489 3.829382 -0.681044
H  0.385759 2.359454 -1.498053
H  1.048257 3.713928 -2.461584
H  -2.214379 1.275536 -2.418328
H  -2.183819 2.993147 -1.923248
H  -3.512431 2.385246 -2.952038
H  2.616281 -3.257913 -0.003981
H  -2.293858 -2.304165 -0.087367
H  0.992004 -5.13051 -0.44506
H  -1.477647 -4.639618 -0.524308
