program: Gaussian 09
title: 000249491
version: EM64L-G09RevD.01
frameworkgroup: C1[X(C13H18O2)]
method: RPBEPBE
basis: SDD
operation: Freq
keyword: #pfreq=noraman
keyword: PBEPBE/SDD
title: #p freq=noraman PBEPBE/SDD
converged: YES YES NO NO
title: Mulliken charges:
elementType: O O C C C C C C C C C C C C C H H H H H H H H H H H H H H H H H H
charge: -0.279528 -0.443456 -0.114078 -0.145570 -0.584524 0.239307 0.259800 -0.406183 -0.410420 -0.247438 -0.379841 -0.231512 -0.226377 -0.342753 -0.689897 0.208473 0.226454 0.248487 0.233403 0.257505 0.241819 0.158314 0.198117 0.184880 0.206776 0.339367 0.225342 0.224756 0.234589 0.181077 0.211782 0.203301 0.218027
chargesum: 0.00000
title: Mulliken charges with hydrogens summed into heavy atoms:
elementType: O O C C C C C C C C C C C C C
charge: -0.279528 -0.104089 0.094396 0.080884 -0.102634 0.239307 0.259800 -0.148678 -0.168602 0.108993 0.011816 -0.006170 -0.001621 0.072914 -0.056787
polarizability: 1.74288421e+02 1.01722965e+01 1.52420411e+02 -1.56001739e+01 6.93081089e+00 1.01001917e+02
1716.lowfreq: -8.7681 -7.0073 -4.4336 -0.0009 -0.0006 -0.0006 24.1504 38.3924 57.3487
frequency: 23.5761 38.3607 57.2567 71.5712 88.3568 113.6849 175.3377 211.8079 227.5621 242.3112 249.4926 276.0433 291.6932 302.1479 349.3526 413.1409 439.6258 457.3822 489.1748 500.2675 576.7259 597.4766 641.3133 712.9424 741.8163 754.8120 805.3165 824.7832 834.7007 857.1339 868.1385 888.3421 927.4221 948.8348 966.6058 988.2207 993.4071 1008.5282 1020.7936 1022.2820 1031.4859 1045.8262 1079.4671 1102.3503 1124.0423 1133.9114 1136.9087 1167.7179 1175.5748 1207.5299 1211.2630 1217.3553 1228.7472 1241.2028 1246.1099 1283.9430 1289.5848 1297.4218 1304.1636 1315.6894 1362.0059 1366.3012 1382.3550 1387.6008 1391.7749 1449.4827 1451.1415 1461.7724 1472.6985 1475.8221 1476.8198 1477.4142 1487.1627 1598.6731 1622.9133 2885.4820 2903.6950 2949.6308 2967.8685 2969.4643 2971.7548 2979.5942 2993.0215 3027.6275 3046.3679 3063.3410 3071.8079 3072.6268 3121.4720 3133.4964 3148.7193 3163.1637 3565.4961
redmass: 3.3838 3.5581 2.4950 3.2613 2.6258 3.3155 3.3680 2.2235 1.8402 1.8897 2.6839 2.9118 1.2858 3.0244 3.8440 3.6646 3.5918 4.0378 3.2386 2.8506 3.4047 4.8560 5.5234 3.1421 1.2022 1.2826 3.4398 1.5944 2.5630 1.8255 2.1330 1.9662 1.9323 1.5184 1.3210 1.3269 2.3193 3.8950 2.1759 2.8063 3.4113 4.0424 2.4772 2.0197 1.8467 1.5191 1.4520 1.0899 1.9104 1.3898 1.3059 1.3588 1.2295 1.2799 1.6226 1.6377 1.1452 1.5325 1.2886 1.3170 1.6050 1.3449 1.5291 1.2186 6.5612 2.4088 1.0946 1.1904 1.0905 1.0561 2.3265 1.0556 1.0833 7.0783 7.3257 1.0603 1.0808 1.0945 1.0846 1.0440 1.0579 1.0661 1.0634 1.0945 1.1004 1.0991 1.1005 1.0994 1.0855 1.0900 1.0947 1.0998 1.0661
irintensity: 0.2463 0.1588 0.5004 0.9046 0.5162 1.3147 3.5170 0.9009 1.2141 1.1337 0.4966 0.5031 115.6329 39.4535 15.5502 8.8239 3.8805 4.4608 1.8267 6.1250 6.7521 3.6570 4.4165 0.9844 14.0998 69.7154 5.0264 3.5674 4.2673 7.2148 1.1805 1.5984 9.2810 2.8068 12.0710 1.4339 34.8349 84.3635 4.1917 24.8156 4.2692 82.3602 61.1012 7.9341 6.7669 14.0213 4.7503 0.8860 7.7138 1.2570 4.3345 11.0146 24.8694 2.3329 1.8841 5.9958 1.2735 3.5593 2.9152 70.9827 1.2634 1.7555 7.4486 9.7887 2.0623 3.5310 7.6534 19.5460 4.7183 5.8920 11.3783 11.4711 14.7221 0.5041 1.9732 79.7000 38.5144 31.2694 41.2778 33.6551 14.6198 90.0354 21.4430 16.5468 4.2491 23.1147 72.5166 68.1434 0.9895 13.2248 30.2567 24.5456 2.1545
temp: 298.150 k
press: 1.00000 atm
elementType: 8 8 6 6 6 6 6 6 6 6 6 6 6 6 6 1 1 1 1 1 1 1 1 1 1 1 1 1 1 1 1 1 1
symmnumber: 1
zpe: 734127.9 jmol-1
zpe.correction: 0.279615 hartree
zpe.thermalcorrener: 0.294806 hartree
zpe.thermalcorrenthalpy: 0.295750 hartree
zpe.thermalcorrgfe: 0.235780 hartree
zpe.sumelectzpe: -655.467602 hartree
zpe.sumelectthermal: -655.452410 hartree
zpe.sumelectthermalent: -655.451466 hartree
zpe.sumelectthermalfe: -655.511436 hartree
dipole: 1.3011 0.1122 -0.0733
dipole: 1.3080
quadrupole: -82.0957 -91.8758 -90.4952
quadrupole: 6.4546 -4.4089 2.4368
quadrupole: 6.0599 -3.7202 -2.3396 6.4546 -4.4089 2.4368
hfenergy: -655.7472167 hartree
pointgroup: C01 [X(C13H18O2)]
dipole: -0.510679 0.028735 0.0567156 debye
polarizability: 173.0234088|-11.8260363|149.3330092|-18.3834299|-12.3891678|105.3543304 unknown
InChI: InChI=1S/C13H18O2/c1-2-3-8-15-13-11-7-5-4-6-10(11)9-12(13)14/h4-7,12-14H,2-3,8-9H2,1H3
charge 0 multiplicity 1
33 atoms
O  -1.209761 0.000675 0.350553
O  -0.09638 3.175777 -0.283304
C  0.059084 0.732377 0.441947
C  0.279348 1.81087 -0.673115
C  1.802921 1.792582 -0.96386
C  1.220645 -0.220953 0.235599
C  2.220381 0.38474 -0.566876
C  1.374576 -1.52953 0.729404
C  3.400767 -0.319077 -0.878217
C  -2.380739 0.795061 0.753396
C  -3.584473 -0.149098 0.839811
C  2.559963 -2.237832 0.414955
C  3.566049 -1.635105 -0.380179
C  -3.94906 -0.801553 -0.513062
C  -5.161531 -1.749803 -0.404415
H  0.120272 1.240686 1.434362
H  -0.291284 1.476684 -1.566909
H  2.282993 2.55463 -0.318582
H  2.040091 2.050492 -2.010234
H  0.581506 -1.990658 1.326913
H  4.17827 0.137791 -1.501493
H  -2.582655 1.593813 -0.000321
H  -2.182483 1.283164 1.734178
H  -4.452758 0.424703 1.224912
H  -3.360246 -0.93697 1.585458
H  -1.082736 3.240505 -0.22489
H  2.699866 -3.26061 0.782881
H  4.477018 -2.19629 -0.61837
H  -3.067453 -1.351728 -0.890206
H  -4.165881 -0.00439 -1.254318
H  -4.95775 -2.573937 0.305243
H  -6.060418 -1.212839 -0.045261
H  -5.407043 -2.202078 -1.382702
