program: Gaussian 09
title: 000249485
version: EM64L-G09RevD.01
frameworkgroup: C1[X(C12H11NO2)]
method: RPBEPBE
basis: SDD
operation: Freq
keyword: #p
keyword: freq=noraman
keyword: PBEPBE/SDD
title: #p freq=noraman PBEPBE/SDD
converged: YES YES NO NO
title: Mulliken charges:
elementType: O O N C C C C C C C C C C C C H H H H H H H H H H H
charge: -0.241357 -0.263904 -0.223648 0.415585 0.150143 0.177528 -0.651415 -0.321985 -0.362630 -0.227881 -0.233709 -0.325203 -0.248780 -0.261333 -0.158033 0.244680 0.253501 0.243219 0.306149 0.244538 0.226164 0.224015 0.284405 0.228618 0.258203 0.263132
chargesum: 0.00000
title: Mulliken charges with hydrogens summed into heavy atoms:
elementType: O O N C C C C C C C C C C C C
charge: -0.241357 -0.263904 -0.223648 0.415585 0.150143 0.177528 0.089985 -0.015837 -0.118092 -0.001718 -0.009694 -0.040798 -0.020162 -0.003130 0.105099
polarizability: 2.38550753e+02 9.21516656e-01 1.40990056e+02 3.02601706e+00 6.79178307e+00 6.51371730e+01
1716.lowfreq: -7.6175 -0.0010 -0.0009 -0.0002 4.3814 9.9268 24.4611 45.8362 60.0449
frequency: 24.3281 45.8212 60.0383 114.2779 162.7699 196.3578 213.9916 249.4547 286.0281 317.8729 357.2109 392.8111 410.1905 456.3545 520.6928 574.2865 587.9444 606.9748 615.9723 660.9625 696.3998 720.7131 739.4306 765.9324 779.0438 838.8876 840.1415 870.2352 878.0703 900.9612 914.0817 971.4378 984.5962 993.8605 999.9539 1019.2584 1033.5353 1054.8968 1089.6270 1099.6180 1116.4703 1132.8975 1172.9856 1187.5600 1198.5213 1202.4812 1245.8686 1319.6629 1348.2525 1363.1611 1380.8783 1439.5374 1443.8716 1463.6976 1482.7107 1485.6183 1490.9995 1542.4130 1559.6143 1586.7851 1612.3166 2998.7390 3087.5093 3126.9859 3134.1240 3137.5753 3156.7849 3169.1878 3212.5776 3225.8569 3246.1919 3265.6087
redmass: 4.7989 4.7745 4.5988 5.1817 4.0159 4.3275 4.1500 1.3578 4.8279 5.4923 4.2131 3.0064 2.8529 6.6665 3.2602 5.5953 3.0798 5.5278 6.2878 6.1848 1.9668 5.2534 1.2922 1.9661 4.3668 1.2484 1.3410 6.0602 4.4721 1.3992 1.4215 1.3564 5.4801 1.3268 1.8599 3.0288 2.1721 2.4946 1.6887 1.8506 1.4314 1.5358 1.0926 2.7832 1.3208 1.6191 3.1881 1.5794 2.9625 2.6781 8.2729 1.7363 1.5156 3.9735 1.3395 1.6279 1.0860 8.4876 6.2360 6.4569 6.0765 1.0369 1.1013 1.0850 1.0984 1.0906 1.0946 1.0985 1.0939 1.0911 1.0989 1.1095
irintensity: 1.0856 1.2890 3.7395 1.4784 2.5436 2.2553 4.5120 0.5494 0.1476 3.8317 1.4809 3.2484 0.2479 1.5772 13.5855 6.9495 8.1407 0.4578 1.0044 12.0946 50.1798 2.0383 81.9966 86.6270 4.9851 0.7196 21.7873 6.5534 30.7642 1.7070 8.8916 0.6204 0.2562 0.9918 14.4574 30.5512 36.0621 92.6483 16.2140 34.7136 12.4752 27.8027 0.1326 3.5667 4.2221 17.8038 7.0365 75.6311 265.9118 18.8442 1.5409 5.1266 12.4708 65.1343 125.9295 36.3921 34.1331 167.8164 56.9990 14.5987 30.4400 33.3597 22.4811 1.6004 15.3953 14.8752 36.5909 15.7442 9.2077 2.9904 0.8507 0.3481
temp: 298.150 k
press: 1.00000 atm
elementType: 8 8 7 6 6 6 6 6 6 6 6 6 6 6 6 1 1 1 1 1 1 1 1 1 1 1
symmnumber: 1
zpe: 529840.8 jmol-1
zpe.correction: 0.201806 hartree
zpe.thermalcorrener: 0.214524 hartree
zpe.thermalcorrenthalpy: 0.215468 hartree
zpe.thermalcorrgfe: 0.161248 hartree
zpe.sumelectzpe: -667.983839 hartree
zpe.sumelectthermal: -667.971120 hartree
zpe.sumelectthermalent: -667.970176 hartree
zpe.sumelectthermalfe: -668.024397 hartree
dipole: 1.7974 -3.1253 0.7755
dipole: 3.6877
quadrupole: -66.6783 -83.1628 -91.2420
quadrupole: -1.0413 0.6318 1.4484
quadrupole: 13.6827 -2.8017 -10.8810 -1.0413 0.6318 1.4484
hfenergy: -668.1856446 hartree
pointgroup: C01 [X(C12H11N1O2)]
dipole: 0.6559014 1.2859033 -0.1457601 debye
dipolederiv: -0.4423556 0.2060404 0.0699853 0.2607353 -0.4222981 -0.1155872 -0.0165012 -0.1382244 -0.1640191 -0.7481869 -0.1081601 -0.0429428 0.2246129 -1.0005852 0.0104791 -0.1808025 -0.0017724 -0.3529113 -1.6342738 0.2427374 -0.0001412 0.4675174 -0.6608128 0.011474 -0.0960539 0.0877413 -0.2336048 1.2447852 0.08618 -0.1202321 0.2929118 -0.0144636 0.0515316 -0.0721539 -0.0013783 0.0861072 2.0582538 -0.184003 0.2143044 -0.7969807 1.1833245 -0.0423438 0.2997266 -0.0306323 0.2439418 -0.5318395 -0.1815009 -0.110696 -0.028357 0.2103594 0.1339181 0.0376539 0.1088087 0.0183808 -0.0075473 0.0538968 0.0131456 0.018678 0.4234217 -0.0385977 0.053729 0.0290162 0.2188587 -0.2947995 -0.0552306 -0.0072229 -0.1882846 -0.0874102 0.0402659 0.019421 0.0102601 -0.1481978 -0.2568417 0.0028204 0.0008874 0.110388 0.0050578 0.0114306 0.014408 0.0578252 -0.1781409 0.0824321 0.0469824 -0.0222194 0.0889817 0.1436793 0.0667814 -0.0014568 0.0462239 -0.1358475 0.0207805 -0.0157643 -0.0414502 -0.1169464 0.0926456 0.0711723 -0.0834119 0.0615431 -0.1317321 0.1370279 0.1100938 0.0794864 0.0054588 -0.0004248 0.0623764 0.0923781 0.0646027 -0.1096859 -0.0361569 0.0269245 -0.0294445 0.071537 -0.1214745 0.004224 -0.0007954 0.0007705 -0.1702981 -0.0183804 -0.028208 0.0013414 -0.1542986 -0.1770663 0.0031267 -0.0795534 0.0063853 -0.2064915 0.0086714 -0.1724293 -0.0633203 -0.1680228 0.159137 0.1165993 -0.0481023 0.1219187 -0.0697755 -0.0254323 0.1075768 -0.1316121 0.0542418 0.0188576 0.0306629 -0.101555 0.0342993 0.0315965 -0.0278648 -0.0721151 0.1171678 -0.0321059 0.0748383 -0.0322341 0.1059879 -0.0200887 0.0689574 0.131162 -0.0099471 0.0033866 -0.0108776 -0.0627694 -0.0423042 -0.0057276 -0.1166763 -0.0526084 0.1962182 0.0652471 0.0326767 0.0338665 0.0762592 -0.0324244 0.0310053 -0.0197372 0.1606141 0.084538 -0.0865243 -0.0088383 -0.0837638 -0.0547541 -0.0356669 -0.0081771 -0.0475292 0.1503186 0.0360215 -0.0682185 0.0015724 -0.1005591 -0.0857762 -0.0426733 -0.0118557 -0.0404469 0.1446235 -0.010116 0.0865509 0.0438881 0.1117208 -0.0380962 -0.0620295 0.0533166 -0.0549896 0.1345917 0.1510047 -0.0283892 -0.0146179 -0.0209316 0.0543734 -0.0604921 -0.0158792 -0.0505649 0.1660812 -0.1405629 -0.0374928 0.0394357 -0.0368336 0.0893419 -0.0115986 0.0420998 -0.0076241 0.159021 -0.044919 0.0262623 -0.0066195 0.0332065 0.137612 -0.0237608 -0.0120274 -0.0274967 0.1883597 0.0683814 -0.0133296 -0.0179206 -0.0358946 0.0570235 -0.0743297 -0.0156728 -0.0722338 0.181861 unknown
polarizability: 238.4713135|3.4712658|138.2841592|-2.5229995|15.7861288|67.9225091 unknown
InChI: InChI=1S/C12H11NO2/c1-13(10-6-3-2-4-7-10)12(14)11-8-5-9-15-11/h2-9H,1H3
charge 0 multiplicity 1
26 atoms
O  2.625762 1.093794 0.545207
O  0.587912 -1.819578 -0.191834
N  -0.177395 0.418757 -0.278002
C  -1.580533 0.128646 -0.091388
C  0.821212 -0.566384 -0.175073
C  2.241066 -0.14847 -0.03234
C  0.176167 1.822373 -0.612844
C  -2.137319 -1.16737 -0.28828
C  -2.445892 1.192272 0.294474
C  -3.520246 -1.375779 -0.098439
C  -3.826098 0.968074 0.476115
C  3.382968 -0.909145 -0.261824
C  -4.37674 -0.318043 0.280115
C  4.519421 -0.130486 0.163168
C  4.024317 1.070034 0.649124
H  -0.602127 2.231833 -1.277708
H  1.135307 1.846369 -1.147273
H  0.26767 2.460864 0.283366
H  -1.48607 -1.992344 -0.574392
H  -2.04718 2.193698 0.479954
H  -3.927721 -2.380706 -0.256815
H  -4.468177 1.802718 0.779436
H  3.381226 -1.91647 -0.671126
H  -5.449029 -0.4913 0.420465
H  5.566248 -0.423593 0.120029
H  4.47755 1.957038 1.083589
