program: Gaussian 09
title: 000004077
version: EM64L-G09RevD.01
frameworkgroup: C1[X(C2H5O3S2)]
method: RPBEPBE
basis: SDD
operation: Freq
keyword: #p
keyword: freq=noraman
keyword: PBEPBE/SDD
title: #p freq=noraman PBEPBE/SDD
converged: YES YES NO NO
title: Mulliken charges:
elementType: S S O O O C C H H H H H
charge: 1.104723 -0.104882 -0.656789 -0.646534 -0.654692 -0.557570 -0.626628 0.250054 0.233847 0.291816 0.287148 0.079507
chargesum: -1.00000
title: Mulliken charges with hydrogens summed into heavy atoms:
elementType: S S O O O C C
charge: 1.104723 -0.025375 -0.656789 -0.646534 -0.654692 -0.073669 -0.047664
polarizability: 1.06932429e+02 1.57599390e+00 6.46230001e+01 2.35414839e-01 3.90828657e+00 6.17468569e+01
1716.lowfreq: -22.8796 -4.9030 -0.0014 0.0019 0.0028 3.7414 56.1942 78.2079 110.2643
frequency: 55.8747 78.0826 110.2608 187.1608 201.9852 240.3380 255.9176 352.8584 361.5367 420.3090 566.0712 633.0505 725.9677 741.9788 797.1453 865.6403 885.1890 981.6982 1070.8898 1106.5153 1186.3663 1260.4338 1263.6133 1415.0432 1457.5504 2425.4769 3042.2019 3053.4860 3117.2090 3151.3642
redmass: 5.8768 1.9581 8.0444 2.5371 1.9424 3.7357 6.0321 10.5967 11.0822 11.8073 8.3285 3.6554 16.0595 1.1634 1.4313 3.1305 16.5361 1.5789 3.6935 1.1456 1.1838 1.1754 1.1913 1.1185 1.0894 1.0383 1.0579 1.0549 1.1070 1.1104
irintensity: 3.0484 2.5751 4.4248 7.2772 17.8629 0.2783 11.5077 12.4554 14.3986 77.1294 28.6863 63.7043 125.1820 6.1853 4.5583 127.9398 136.0889 27.8349 24.9411 12.0488 14.8062 1.8580 7.3630 5.3684 10.8872 40.5281 7.1728 14.5904 0.3745 10.1195
temp: 298.150 k
press: 1.00000 atm
elementType: 16 16 8 8 8 6 6 1 1 1 1 1
symmnumber: 1
zpe: 191469.6 jmol-1
zpe.correction: 0.072927 hartree
zpe.thermalcorrener: 0.082057 hartree
zpe.thermalcorrenthalpy: 0.083001 hartree
zpe.thermalcorrgfe: 0.037725 hartree
zpe.sumelectzpe: -1100.325188 hartree
zpe.sumelectthermal: -1100.316058 hartree
zpe.sumelectthermalent: -1100.315114 hartree
zpe.sumelectthermalfe: -1100.360390 hartree
dipole: 7.2928 1.5407 0.3802
dipole: 7.4635
quadrupole: -90.3016 -66.4791 -68.0572
quadrupole: 3.1638 2.3621 1.2125
quadrupole: -15.3557 8.4669 6.8888 3.1638 2.3621 1.2125
hfenergy: -1100.3981147 hartree
pointgroup: C01 [X(C2H5O3S2)]
dipole: 2.8490863 -0.5992341 -0.3819 debye
dipolederiv: 1.9199811 -0.0647096 -0.0143431 -0.2067634 1.4589949 -0.0008214 -0.0106091 -0.0054432 1.4643963 -0.832997 -0.0083473 0.0861323 0.0090745 -0.2241677 0.1511042 0.1443516 0.1274826 0.0343737 -0.7437875 0.0106144 0.0125987 0.1425501 -0.7248426 0.1363871 -0.1475667 0.1911436 -0.8431425 -0.9454609 -0.1020586 0.0092237 -0.3076916 -0.8085113 0.0077704 0.0016655 -0.0007585 -0.6023441 -0.7354783 0.0068072 -0.0076409 0.1346778 -0.7161942 -0.1384272 0.1444985 -0.1809739 -0.8545155 -0.562852 0.0984637 0.0246321 0.0716332 -0.1570762 0.0071962 0.0053308 0.0004666 -0.0456142 0.7598248 -0.1019826 -0.0124374 0.1536336 0.040689 -0.0352218 -0.1038043 0.012883 0.0284661 0.0309663 0.0324992 -0.034509 -0.0190281 -0.0137419 0.0784259 -0.0050911 0.0842138 -0.0181406 0.0218479 0.0343896 0.0388116 -0.0200508 -0.0028837 -0.0747857 0.0197901 -0.0944085 -0.0481014 0.0589887 0.0338911 0.0187279 -0.0099642 0.0643916 -0.061616 -0.0670659 -0.0783892 0.0139358 -0.0031054 0.0675863 -0.0295474 0.0000983 0.0229604 0.0574962 0.0525769 0.0875314 0.0029953 0.0320725 -0.0071535 -0.0916484 0.0518306 0.0603817 -0.1275079 -0.0340763 -0.1437477 -0.1323089 unknown
polarizability: 106.8000107|-2.4849767|62.0726165|-1.3246464|4.0426542|64.4296591 unknown
InChI: InChI=1S/C2H5O3S2/c3-7(4,5)2-1-6/h6H,1-2H2
charge -1 multiplicity 1
12 atoms
S  -1.215872 0.052168 0.008098
S  3.43283 -0.172068 -0.005722
O  -1.251094 0.958948 -1.3737
O  -2.197762 -1.271583 0.005527
O  -1.211129 0.929644 1.408274
C  0.604751 -0.727199 -0.028299
C  1.59847 0.41258 -0.007904
H  0.635468 -1.369221 0.864918
H  0.605514 -1.317203 -0.958959
H  1.499349 0.998661 0.920844
H  1.454827 1.078493 -0.873492
H  3.374649 -0.82442 -1.227486
