program: Gaussian 09
title: 000249464
version: EM64L-G09RevD.01
frameworkgroup: C1[X(C20H17NO2)]
method: RPBEPBE
basis: SDD
operation: Freq
keyword: #p
keyword: freq=noraman
keyword: PBEPBE/SDD
title: #p freq=noraman PBEPBE/SDD
converged: YES YES NO NO
title: Mulliken charges:
elementType: O O N C C C C C C C C C C C C C C C C C C C C H H H H H H H H H H H H H H H H H
charge: -0.415206 -0.232318 -0.004207 0.048047 -0.121127 0.310125 0.283433 -0.727781 0.360052 -0.723023 -0.769460 0.113668 -0.388083 0.273311 -0.446420 -0.113491 -0.262061 -0.245330 0.041098 -0.363268 -0.328187 -0.257383 -0.232638 0.256764 0.242142 0.233818 0.228243 0.226031 0.255397 0.226873 0.202604 0.246681 0.239259 0.226222 0.228281 0.273434 0.265818 0.230940 0.233987 0.383757
chargesum: 0.00000
title: Mulliken charges with hydrogens summed into heavy atoms:
elementType: O O N C C C C C C C C C C C C C C C C C C C C
charge: -0.031449 -0.232318 -0.004207 0.048047 -0.121127 0.310125 0.283433 -0.228874 0.360052 -0.034931 -0.084586 0.113668 -0.141403 0.273311 -0.207162 -0.113491 -0.035840 -0.017049 0.041098 -0.089834 -0.062369 -0.026444 0.001349
polarizability: 3.26357609e+02 1.31075105e+01 2.42398002e+02 5.17515980e+00 1.26865060e+00 1.29759052e+02
1716.lowfreq: -8.1722 -4.1927 -1.9359 -0.0009 -0.0003 0.0006 29.8325 46.3667 68.3856
frequency: 29.8089 46.3530 68.3817 79.6902 106.2639 123.8190 149.3550 181.4628 190.9170 209.4530 222.4352 266.1883 266.8227 279.5792 292.3726 311.1609 326.6850 335.3940 371.3214 376.8756 396.9734 438.2041 447.1752 478.6222 507.1409 520.0166 528.4369 551.7981 565.2341 586.6953 596.4578 627.5594 637.5860 651.1814 697.3492 712.0601 729.0268 739.3830 754.0124 768.1304 778.0878 802.0315 821.0442 834.3279 852.7781 870.2622 883.6752 914.7862 923.2528 936.3362 940.8895 959.4707 969.4685 987.4164 997.5504 1001.5059 1027.7246 1035.7134 1049.1616 1081.0695 1081.5653 1116.4947 1139.7738 1144.2716 1166.7611 1176.5921 1183.5376 1200.2548 1213.0371 1239.8646 1252.2128 1256.9749 1270.1342 1288.1560 1316.2197 1323.5746 1347.4510 1369.6964 1382.8138 1389.6310 1396.1450 1414.6840 1438.0702 1440.5461 1446.9480 1459.8768 1463.6723 1478.1162 1485.5022 1487.9799 1491.5414 1548.0348 1562.5033 1594.3730 1613.8974 1618.6028 1636.3534 2957.4634 2980.3728 2994.1221 3066.6725 3081.6538 3083.2157 3086.7893 3115.6241 3116.0499 3131.6181 3134.5023 3150.7735 3151.5431 3166.2803 3169.3413 3180.4737 3498.5744
redmass: 4.8368 6.0619 6.5080 4.5747 3.6388 4.0991 5.2692 3.6790 2.7733 1.2717 3.9530 1.3695 2.9606 3.0866 3.8827 2.5426 3.9430 3.9368 4.5015 5.3491 3.7994 2.9794 3.8341 3.7331 4.3500 3.7916 4.1316 3.8776 3.1946 5.0611 4.8587 1.6064 4.5869 5.4918 4.1158 4.1236 4.2264 3.8850 2.5997 1.7999 1.4903 3.4326 4.9060 3.7743 4.3574 1.4207 1.6770 2.4422 3.8351 2.0868 1.7726 1.6792 1.3702 1.3251 1.3311 1.3105 2.3005 2.7937 2.7347 2.4647 2.7354 1.8942 2.6070 1.4758 1.4557 1.0835 1.1695 1.9817 2.1719 2.2885 2.2839 2.1991 2.1064 2.0724 3.2726 1.9656 5.7579 1.2408 6.4356 2.8802 1.2478 5.4221 1.1387 2.2415 2.8607 1.0909 1.0564 1.0671 2.1438 1.4327 1.9985 8.7765 8.1022 7.0985 6.4537 6.1531 8.7994 1.0700 1.0336 1.0373 1.0886 1.1005 1.1011 1.0997 1.0969 1.0878 1.0886 1.0863 1.0907 1.0940 1.0984 1.0969 1.0967 1.0638
irintensity: 0.2282 0.2852 1.3649 0.5636 0.3463 1.0593 0.2295 1.8229 1.7553 0.3113 1.0365 0.4002 1.6405 0.9099 1.5396 2.1089 0.0288 3.2087 1.7307 0.8533 0.8762 5.1216 8.7457 0.9611 0.7550 4.9541 3.3756 3.7356 7.9584 15.3752 51.6914 104.2047 9.7739 9.1484 9.5877 2.0959 8.5125 7.3369 20.5767 39.9981 92.5811 1.7260 0.8807 1.4891 3.8589 0.3244 1.3777 1.9893 26.9627 6.1570 10.9057 5.0836 1.3900 0.0533 0.5202 2.7211 4.2983 93.9517 112.7511 61.1209 24.9623 22.9239 12.7429 32.9551 25.4119 1.5669 5.9750 3.0282 1.7624 3.8288 9.3447 12.1265 1.7042 11.2783 21.2927 18.4149 22.9737 14.3049 7.4562 4.9430 28.0653 8.3755 23.3433 3.9464 12.3334 7.1283 5.2139 21.4838 36.1961 41.2697 5.6040 27.0585 14.3429 2.1529 3.8788 2.5493 208.9580 6.7005 28.8373 29.5138 12.2681 14.2988 21.3904 51.2010 19.5005 7.0448 9.3327 5.0507 15.1960 28.3443 30.7018 15.0414 16.7440 36.2928
temp: 298.150 k
press: 1.00000 atm
elementType: 8 8 7 6 6 6 6 6 6 6 6 6 6 6 6 6 6 6 6 6 6 6 6 1 1 1 1 1 1 1 1 1 1 1 1 1 1 1 1 1
symmnumber: 1
zpe: 827426.3 jmol-1
zpe.correction: 0.315150 hartree
zpe.thermalcorrener: 0.334046 hartree
zpe.thermalcorrenthalpy: 0.334991 hartree
zpe.thermalcorrgfe: 0.268627 hartree
zpe.sumelectzpe: -975.961111 hartree
zpe.sumelectthermal: -975.942215 hartree
zpe.sumelectthermalent: -975.941270 hartree
zpe.sumelectthermalfe: -976.007634 hartree
dipole: 0.5205 0.8132 1.4589
dipole: 1.7494
quadrupole: -121.2294 -122.0581 -138.1241
quadrupole: 4.0288 -3.0396 5.4140
quadrupole: 5.9078 5.0791 -10.9869 4.0288 -3.0396 5.4140
hfenergy: -976.2762611 hartree
pointgroup: C01 [X(C20H17N1O2)]
dipole: -0.212722 -0.2172355 0.617491 debye
polarizability: 327.2169785|8.1240493|238.3617405|-8.6199429|-18.2215028|132.9359444 unknown
InChI: InChI=1S/C20H17NO2/c1-20(2)15-9-5-3-7-12(15)11-14-17(19(22)23)13-8-4-6-10-16(13)21-18(14)20/h3-10,22H,11H2,1-2H3
charge 0 multiplicity 1
40 atoms
O  0.955217 -2.949191 1.694525
O  2.339189 -3.267663 -0.129663
N  0.91297 1.723055 -0.228233
C  -1.488247 1.591055 0.332178
C  -0.108413 0.924999 0.125812
C  -2.600378 0.629459 -0.131544
C  0.055403 -0.491971 0.380159
C  -1.180362 -1.29877 0.743747
C  -2.446375 -0.765097 0.092138
C  -1.652635 1.847016 1.873568
C  -1.547271 2.957975 -0.390279
C  1.344424 -1.048329 0.255564
C  -3.795229 1.093466 -0.735527
C  2.459324 -0.218875 -0.155053
C  -3.47399 -1.660664 -0.286492
C  2.179535 1.184101 -0.37719
C  -4.824286 0.198023 -1.101931
C  -4.666334 -1.187635 -0.875786
C  1.60425 -2.497034 0.531893
C  3.80563 -0.68117 -0.330322
C  3.234748 2.071274 -0.760535
C  4.817423 0.207974 -0.703305
C  4.535719 1.593094 -0.921248
H  -1.291942 -1.290834 1.848429
H  -1.046713 -2.360614 0.48236
H  -0.86291 2.535348 2.224425
H  -2.637891 2.305739 2.071194
H  -1.587774 0.915325 2.462911
H  -0.675383 3.566009 -0.105214
H  -1.521688 2.834809 -1.487423
H  -2.465272 3.506829 -0.114012
H  -3.928141 2.161876 -0.928586
H  -3.337011 -2.73643 -0.120455
H  -5.740011 0.579763 -1.567135
H  -5.456221 -1.890336 -1.163073
H  4.035137 -1.740694 -0.195184
H  2.975879 3.122564 -0.917991
H  5.839783 -0.16239 -0.836518
H  5.342788 2.273047 -1.214682
H  1.185257 -3.909805 1.828878
