program: Gaussian 09
title: 000249459
version: EM64L-G09RevD.01
frameworkgroup: C1[X(C15H8N2O2)]
method: RPBEPBE
basis: SDD
operation: Freq
keyword: #p
keyword: freq=noraman
keyword: PBEPBE/SDD
title: #p freq=noraman PBEPBE/SDD
converged: NO YES YES YES
title: Mulliken charges:
elementType: O O N N C C C C C C C C C C C C C C C H H H H H H H H
charge: -0.119571 -0.304455 -0.076915 0.099568 0.143743 0.349844 -0.332655 0.338758 -0.201379 0.308848 0.055191 -0.407681 -0.407135 -0.389215 -0.211864 -0.328427 -0.220371 -0.208244 -0.219005 0.305197 0.285616 0.302652 0.274841 0.238375 0.240008 0.242151 0.242123
chargesum: 0.00000
title: Mulliken charges with hydrogens summed into heavy atoms:
elementType: O O N N C C C C C C C C C C C C C C C
charge: -0.119571 -0.304455 -0.076915 0.099568 0.143743 0.349844 -0.332655 0.338758 -0.201379 0.308848 0.055191 -0.102484 -0.121519 -0.086563 0.026511 -0.053586 0.019638 0.033907 0.023118
polarizability: 3.55587419e+02 -1.87127554e+00 2.02719313e+02 -6.58048699e-03 5.22859337e-03 6.48957805e+01
1716.lowfreq: -7.8524 -5.1625 -2.4122 -0.0008 -0.0006 0.0005 54.7556 89.3121 133.9103
frequency: 54.7468 89.3090 133.9102 148.6418 150.3811 175.2942 251.0410 284.4422 307.9471 319.8367 340.7501 374.2193 414.4434 449.9075 471.4667 507.7558 529.6729 554.8681 560.1611 568.5170 602.1873 637.2770 658.4659 684.0059 695.6033 739.0115 770.3939 782.7164 785.2243 793.4078 851.8689 859.5145 894.4362 903.9296 916.1292 979.9610 980.4181 992.3306 1003.5280 1006.7081 1017.0315 1030.2165 1058.0485 1085.3865 1115.5745 1146.9874 1169.0414 1183.9199 1200.6635 1216.4418 1252.6091 1271.6615 1294.6986 1327.0914 1384.5482 1392.5110 1420.8934 1442.6073 1454.3786 1468.6001 1507.7017 1529.5443 1567.8721 1595.5610 1604.7955 1616.7047 1643.9708 3138.8711 3144.9585 3152.6840 3160.7143 3167.8702 3176.4590 3184.8597 3188.1780
redmass: 6.2580 5.3984 5.0511 7.8159 5.7236 5.6038 8.8984 6.6967 7.6002 5.7308 6.7939 9.3341 3.4368 3.7464 4.2265 8.0538 8.5805 3.7269 9.3449 8.7897 5.2781 7.4171 5.1806 6.9333 7.3484 3.1672 1.8756 3.0730 1.3313 6.5831 3.7273 7.0451 1.4677 8.2289 1.5332 1.4300 1.3737 5.1261 1.3283 1.3590 2.0408 2.5366 4.2527 2.3381 1.8900 1.5805 1.2996 1.7675 1.9962 2.2621 2.3828 4.7077 2.1973 2.9828 3.7695 6.5950 2.9132 2.9048 2.6888 3.3542 6.0638 11.6756 7.3944 7.1831 7.5650 7.1402 12.0398 1.0866 1.0869 1.0917 1.0911 1.0981 1.0960 1.0981 1.0965
irintensity: 4.6484 0.0833 0.1023 3.1843 1.4651 0.0454 1.1030 0.0224 7.8428 1.8140 0.1734 2.4222 0.2689 3.6266 13.7552 1.2762 1.6484 2.3561 2.2124 1.4444 2.5445 2.9234 6.4633 2.9757 1.2848 19.1298 32.3621 13.9899 115.0647 0.3213 5.1533 3.8794 0.0292 32.2017 0.3403 1.4126 9.5278 28.4696 0.2915 0.4330 6.1040 19.7331 13.0210 10.1477 3.7234 18.2427 16.1958 14.8354 19.4366 4.8939 23.2744 34.5883 29.5048 3.6388 17.2177 12.1971 17.2824 2.1664 18.2128 5.1782 47.0519 29.9087 17.2156 0.9686 83.7928 7.7863 154.3084 1.9015 5.1747 7.1988 11.8887 25.7926 5.5354 14.5818 5.5221
temp: 298.150 k
press: 1.00000 atm
elementType: 8 8 7 7 6 6 6 6 6 6 6 6 6 6 6 6 6 6 6 1 1 1 1 1 1 1 1
symmnumber: 1
zpe: 505650.0 jmol-1
zpe.correction: 0.192592 hartree
zpe.thermalcorrener: 0.205700 hartree
zpe.thermalcorrenthalpy: 0.206644 hartree
zpe.thermalcorrgfe: 0.152941 hartree
zpe.sumelectzpe: -835.048214 hartree
zpe.sumelectthermal: -835.035106 hartree
zpe.sumelectthermalent: -835.034162 hartree
zpe.sumelectthermalfe: -835.087864 hartree
dipole: -0.9130 -2.7946 0.0000
dipole: 2.9400
quadrupole: -71.3971 -121.0100 -111.0285
quadrupole: -6.1939 -0.0012 -0.0001
quadrupole: 29.7481 -19.8648 -9.8833 -6.1939 -0.0012 -0.0001
hfenergy: -835.2408056 hartree
pointgroup: C01 [X(C15H8N2O2)]
dipole: 0.3524304 -1.101669 -0.0000119 debye
polarizability: 355.6046739|0.9292998|202.7020575|-0.0066126|-0.005188|64.8957805 unknown
InChI: InChI=1S/C15H8N2O2/c18-15-10-6-2-1-5-9(10)14-13(15)16-11-7-3-4-8-12(11)17(14)19/h1-8H
charge 0 multiplicity 1
27 atoms
O  -1.639977 3.045991 -0.000205
O  0.541104 -2.508798 -0.000022
N  0.718733 -1.194394 0.000201
N  1.135754 1.698695 -0.000148
C  -0.319789 -0.305342 0.000094
C  -1.756743 -0.568742 0.0000
C  -0.064073 1.111418 -0.000057
C  -2.428877 0.696514 -0.000085
C  -1.423019 1.808573 0.00006
C  2.045799 -0.637272 -0.00006
C  2.210017 0.797697 -0.0002
C  -2.488202 -1.773374 -0.000013
C  -3.829969 0.775094 -0.000218
C  3.157314 -1.509479 -0.000155
C  -3.904391 -1.686303 -0.000142
C  3.538211 1.315839 -0.00041
C  -4.570349 -0.434172 -0.000252
C  4.450276 -0.962041 -0.000358
C  4.640847 0.451271 -0.000482
H  -1.97041 -2.735093 0.000056
H  -4.325666 1.751183 -0.000276
H  2.975066 -2.587005 -0.000036
H  3.652163 2.403727 -0.000512
H  -4.497037 -2.607641 -0.000168
H  -5.664957 -0.405092 -0.000348
H  5.319966 -1.6272 -0.000415
H  5.655912 0.861346 -0.000644
