program: Gaussian 09
title: 000019773
version: EM64L-G09RevD.01
frameworkgroup: C1[X(C15H32)]
method: RPBEPBE
basis: SDD
operation: Freq
keyword: #p
keyword: freq=noraman
keyword: PBEPBE/SDD
title: #p freq=noraman PBEPBE/SDD
converged: YES YES NO NO
title: Mulliken charges:
elementType: C C C C C C C C C C C C C C C H H H H H H H H H H H H H H H H H H H H H H H H H H H H H H H H
charge: -0.019737 -0.405913 -0.418134 -0.410164 -0.398762 -0.421381 0.020347 -0.361627 -0.753117 -0.026996 -0.374278 -0.752795 -0.716875 -0.714266 -0.716505 0.190151 0.198578 0.183002 0.203005 0.187662 0.186613 0.214416 0.191377 0.183247 0.201041 0.214921 0.179907 0.185143 0.185112 0.211637 0.213792 0.211893 0.192333 0.192734 0.195460 0.203421 0.222058 0.218861 0.221779 0.203273 0.209632 0.205338 0.211074 0.212265 0.214401 0.209352 0.216726
chargesum: 0.00000
title: Mulliken charges with hydrogens summed into heavy atoms:
elementType: C C C C C C C C C C C C C C C
charge: 0.170414 -0.024333 -0.027468 -0.009135 -0.024138 -0.005419 0.200254 0.008628 -0.115795 0.165337 0.013916 -0.108456 -0.082191 -0.085588 -0.076026
polarizability: 1.86384199e+02 -1.22509713e+00 1.63187541e+02 2.76750166e+00 1.34154920e+00 1.40561652e+02
1716.lowfreq: -4.2157 -0.0007 -0.0005 0.0003 9.2168 14.3778 19.7475 25.2856 40.6951
frequency: 19.2951 22.9525 39.9735 59.5593 73.4189 88.3645 93.8824 106.3619 108.8891 132.5929 158.9439 187.8260 197.4987 202.2523 215.9903 229.2313 236.7353 247.3939 258.1324 286.8812 300.6767 358.4312 370.4314 389.7965 411.8367 424.9941 435.1885 479.8310 491.7779 562.4599 734.7772 738.9921 764.8212 782.6354 801.0699 821.2736 836.2014 847.4387 907.0917 915.6330 928.7446 933.0299 952.0027 955.9951 968.0295 982.8891 985.4684 1013.6001 1016.7427 1031.4119 1046.4113 1058.5522 1061.2028 1074.3321 1108.9109 1127.8871 1151.0684 1160.3058 1163.4544 1174.0946 1178.0189 1188.2987 1210.8255 1234.1204 1246.7435 1258.4761 1270.9074 1276.4398 1282.8728 1288.5776 1301.1766 1303.4648 1313.5029 1329.8121 1331.1516 1335.9119 1342.0608 1347.2141 1348.8674 1355.7339 1363.7202 1377.1529 1382.9915 1384.6570 1392.3460 1392.7713 1453.6188 1456.4119 1462.0178 1466.1112 1468.8451 1470.1874 1472.3992 1473.8015 1475.0590 1476.8237 1478.5099 1482.6752 1485.6006 1486.1849 1488.6859 1490.7269 1495.4190 2936.9566 2939.6567 2941.5923 2943.8148 2952.6432 2952.9817 2957.8572 2959.6277 2961.0345 2964.5689 2968.4140 2969.0270 2971.6254 2973.6348 2975.0649 2991.6103 2994.7459 2999.8030 3003.4777 3011.2649 3036.9066 3044.1815 3056.5917 3063.0611 3063.5702 3063.9957 3064.3220 3066.7487 3067.9584 3071.6015 3071.9210 3077.2430
redmass: 2.7159 3.2304 2.4515 3.0375 2.8575 2.7118 1.7466 2.2070 2.4919 1.7646 1.5829 1.7871 1.1254 1.6330 1.2375 2.1208 2.3626 1.2766 1.1493 2.6589 2.3844 2.4325 2.3027 2.3053 1.9524 2.1550 2.4191 2.8713 2.4175 2.2849 1.1247 1.1388 1.4249 2.1092 1.7597 1.7004 1.9720 1.4295 1.9844 1.1785 1.6486 1.6529 1.3619 1.3852 1.3495 1.8296 1.7343 2.2030 1.9541 1.6607 1.5411 2.1033 2.6829 2.4822 1.7005 2.0352 2.2769 1.9153 2.1417 1.8150 2.0562 1.7001 1.5289 1.2992 1.3070 1.2598 1.2377 1.2407 1.1911 1.1238 1.1309 1.3244 1.2857 1.4613 1.4625 1.4641 1.5767 1.3907 1.4475 1.5731 1.4522 1.2224 1.2231 1.2285 1.2130 1.2065 1.0750 1.0726 1.0708 1.0687 1.0801 1.0472 1.0560 1.0540 1.0493 1.0593 1.0743 1.0581 1.0639 1.0681 1.0889 1.0522 1.0462 1.0756 1.0758 1.0622 1.0641 1.0725 1.0704 1.0605 1.0608 1.0641 1.0358 1.0399 1.0363 1.0370 1.0607 1.0370 1.0954 1.0962 1.1014 1.0977 1.1007 1.1023 1.1024 1.0992 1.0992 1.0990 1.0989 1.0979 1.0986 1.0994 1.0994 1.0988 1.0983
irintensity: 0.0030 0.0015 0.0036 0.0088 0.0096 0.0279 0.0015 0.0038 0.0222 0.0121 0.0300 0.0090 0.0047 0.0231 0.0184 0.0303 0.0639 0.0846 0.0443 0.0758 0.0142 0.0312 0.1105 0.1611 0.3408 0.3112 0.2527 1.4081 0.2769 5.9782 3.7100 7.3758 7.1455 3.2915 0.5351 0.6781 2.9901 0.8249 3.0948 4.2379 2.9037 6.8060 0.5698 0.7514 9.4519 2.9457 0.1155 3.2296 2.4998 1.1232 1.4370 0.9761 2.8479 1.2549 0.9159 6.0286 2.2219 4.7052 0.4742 13.5570 3.8460 4.8761 2.4454 3.9307 5.9077 2.8878 0.7402 0.9498 0.3076 1.0619 0.1248 5.6189 4.1886 0.9152 1.4503 1.7036 0.3123 1.9686 2.6913 1.4637 3.1442 20.7576 22.9312 12.4767 13.0745 14.6618 0.4502 0.3014 5.9017 0.3353 0.6167 2.1738 2.3838 11.4404 9.9171 4.4736 4.1539 9.9759 0.8498 30.3322 12.7989 26.6347 12.7748 16.6437 8.7822 10.7401 8.6581 5.4382 14.1904 5.4944 5.3271 158.8836 49.0946 38.9137 18.7395 25.4644 65.5634 33.6674 16.5185 24.7165 3.8666 25.2100 20.4264 93.1304 107.3192 14.0571 43.8477 51.2895 128.2258 6.2323 88.6479 61.2009 99.4263 29.5831 42.1930
temp: 298.150 k
press: 1.00000 atm
elementType: 6 6 6 6 6 6 6 6 6 6 6 6 6 6 6 1 1 1 1 1 1 1 1 1 1 1 1 1 1 1 1 1 1 1 1 1 1 1 1 1 1 1 1 1 1 1 1
symmnumber: 1
zpe: 1145269.2 jmol-1
zpe.correction: 0.436210 hartree
zpe.thermalcorrener: 0.456932 hartree
zpe.thermalcorrenthalpy: 0.457876 hartree
zpe.thermalcorrgfe: 0.385149 hartree
zpe.sumelectzpe: -589.513861 hartree
zpe.sumelectthermal: -589.493140 hartree
zpe.sumelectthermalent: -589.492196 hartree
zpe.sumelectthermalfe: -589.564922 hartree
dipole: 0.0490 0.1910 -0.0247
dipole: 0.1987
quadrupole: -100.6775 -100.8190 -100.5314
quadrupole: 0.3470 -0.2939 -0.7799
quadrupole: -0.0015 -0.1430 0.1446 0.3470 -0.2939 -0.7799
hfenergy: -589.9500715 hartree
pointgroup: C01 [X(C15H32)]
dipole: 0.0178313 0.0755752 -0.0089444 debye
polarizability: 186.4596528|-0.8222033|163.1141431|2.3876523|1.6674652|140.5595965 unknown
InChI: InChI=1S/C15H32/c1-6-14(4)10-8-12-15(5)11-7-9-13(2)3/h13-15H,6-12H2,1-5H3
charge 0 multiplicity 1
47 atoms
C  -0.699456 2.399497 -0.309995
C  0.474159 1.785259 0.502337
C  -1.670793 1.339491 -0.906877
C  1.398163 0.842863 -0.303093
C  2.629229 0.38403 0.512393
C  -2.402025 0.433054 0.111809
C  3.682998 -0.437506 -0.2801
C  -3.354411 -0.564749 -0.588163
C  -1.45092 3.454808 0.538708
C  -4.217287 -1.438135 0.362535
C  4.951544 -0.650396 0.592298
C  3.101984 -1.780437 -0.784705
C  -3.35279 -2.351698 1.265043
C  -5.224763 -2.284784 -0.451719
C  6.151047 -1.279392 -0.149931
H  -0.24836 2.932233 -1.176689
H  0.073722 1.245254 1.385436
H  1.086691 2.618106 0.908365
H  -1.11509 0.693994 -1.61763
H  -2.433054 1.872016 -1.514412
H  1.742197 1.367315 -1.220188
H  0.821834 -0.038988 -0.643575
H  2.289122 -0.212808 1.38602
H  3.127095 1.285443 0.929194
H  -2.985359 1.055369 0.820988
H  -1.660279 -0.124146 0.716504
H  3.982744 0.163979 -1.167333
H  -4.033502 0.005537 -1.257219
H  -2.761577 -1.234409 -1.248434
H  -0.775757 4.281826 0.828443
H  -1.852703 3.014308 1.470488
H  -2.299632 3.889206 -0.022687
H  -4.79424 -0.752594 1.020404
H  4.683277 -1.281934 1.465556
H  5.26194 0.331967 1.004496
H  2.778767 -2.407674 0.069476
H  2.22652 -1.623681 -1.440118
H  3.847286 -2.354292 -1.364064
H  -2.690031 -1.769317 1.930094
H  -2.716563 -3.016716 0.648366
H  -3.989195 -2.991817 1.904494
H  -4.689888 -2.984572 -1.123337
H  -5.874785 -2.885218 0.21182
H  -5.87443 -1.645396 -1.078538
H  7.040538 -1.328665 0.505231
H  6.422577 -0.681541 -1.041145
H  5.932957 -2.308286 -0.488949
