program: Gaussian 09
title: 000249436
version: EM64L-G09RevD.01
frameworkgroup: C1[X(C12H9NO3)]
method: RPBEPBE
basis: SDD
operation: Freq
keyword: #p
keyword: freq=noraman
keyword: PBEPBE/SDD
title: #p freq=noraman PBEPBE/SDD
converged: YES YES NO NO
title: Mulliken charges:
elementType: O O O N C C C C C C C C C C C C H H H H H H H H H
charge: -0.220436 -0.428145 -0.206119 -0.007409 0.480541 0.374427 -0.272343 -0.341043 -0.453930 -0.374647 -0.386989 0.082634 -0.237758 -0.235288 -0.234270 0.125103 0.257730 0.237419 0.290693 0.224403 0.236442 0.230254 0.232987 0.234523 0.391221
chargesum: 0.00000
title: Mulliken charges with hydrogens summed into heavy atoms:
elementType: O O O N C C C C C C C C C C C C
charge: -0.220436 -0.036924 -0.206119 -0.007409 0.480541 0.374427 -0.014614 -0.103624 -0.163237 -0.150245 -0.150547 0.082634 -0.007503 -0.002300 0.000253 0.125103
polarizability: 3.46818878e+02 -3.33610660e+00 1.39378137e+02 5.17806186e-02 -2.47159968e-02 5.73267867e+01
1716.lowfreq: -6.1039 -0.0009 -0.0008 -0.0006 1.5485 11.0373 31.6294 40.2801 52.0427
frequency: 31.5757 40.2724 52.0192 65.1243 98.5159 152.1809 180.1084 196.8290 259.0137 284.9979 336.0390 402.7344 402.7814 443.7974 496.9300 508.4545 550.3015 584.9034 614.9730 621.7087 646.1801 663.0307 694.5896 741.5953 746.3445 770.1049 836.0570 842.1268 848.5829 857.9742 882.5253 916.1914 924.4147 954.9667 978.7650 986.6724 988.0974 1002.3755 1025.7231 1045.7176 1084.4459 1113.0539 1174.7792 1193.0919 1201.3444 1239.2047 1254.7641 1296.1994 1304.1140 1339.7871 1379.3032 1386.2542 1421.9538 1442.0062 1483.3812 1553.4750 1583.3445 1608.7935 1646.9152 1674.2494 3112.6491 3125.0030 3128.1027 3138.3871 3141.9730 3152.3369 3168.3258 3260.5707 3525.2539
redmass: 4.9553 8.6015 6.3170 6.4859 4.3035 6.3657 7.4909 4.1384 2.5555 7.1173 5.4813 7.9460 2.7728 5.4206 3.0604 6.3400 2.1447 6.0232 6.4316 2.1522 4.5907 3.7131 1.6734 5.4480 5.3938 1.8039 5.3240 1.4336 1.3635 9.1343 1.7900 7.2016 1.4349 8.2270 1.3526 1.2389 6.1351 1.3110 2.1987 3.1317 1.6543 1.3505 1.0762 1.1728 2.2725 3.7409 1.7811 1.5992 1.5447 1.2819 10.1666 6.9014 5.5371 2.4839 2.2926 6.7642 5.7383 5.8175 5.9493 9.4888 1.0917 1.0865 1.0870 1.0891 1.0908 1.0962 1.1016 1.0996 1.0642
irintensity: 2.0433 0.2120 0.5126 0.8444 0.0514 0.4346 0.3033 0.0338 1.3957 0.3530 1.1963 14.9000 0.0462 0.0341 6.7328 6.2431 49.7336 2.2955 0.1087 104.7741 79.0833 11.2929 46.6249 5.0525 23.1161 54.8522 6.1349 6.9808 14.2125 15.5277 22.2940 3.2964 0.3484 90.3967 5.5800 43.8150 0.5479 10.5261 4.9246 242.9207 7.5321 55.3891 0.7418 6.4250 2.9243 11.2024 26.3340 26.0239 1.5326 6.4902 123.2177 7.7156 61.3733 3.0773 4.8066 51.1227 11.3335 3.5455 106.5314 323.2901 2.8563 6.7468 3.0380 15.5737 0.4781 37.9434 32.9878 9.3213 51.1998
temp: 298.150 k
press: 1.00000 atm
elementType: 8 8 8 7 6 6 6 6 6 6 6 6 6 6 6 6 1 1 1 1 1 1 1 1 1
symmnumber: 1
zpe: 477360.0 jmol-1
zpe.correction: 0.181817 hartree
zpe.thermalcorrener: 0.195379 hartree
zpe.thermalcorrenthalpy: 0.196323 hartree
zpe.thermalcorrgfe: 0.139329 hartree
zpe.sumelectzpe: -741.930248 hartree
zpe.sumelectthermal: -741.916686 hartree
zpe.sumelectthermalent: -741.915742 hartree
zpe.sumelectthermalfe: -741.972736 hartree
dipole: 3.9400 4.3122 0.0050
dipole: 5.8412
quadrupole: -82.2268 -87.8550 -96.4782
quadrupole: -18.4664 -0.0234 -0.0216
quadrupole: 6.6265 0.9983 -7.6249 -18.4664 -0.0234 -0.0216
hfenergy: -742.1120653 hartree
pointgroup: C01 [X(C12H9N1O3)]
dipole: -1.5527612 -1.6887086 0.1356773 debye
dipolederiv: -0.5808395 0.1604001 -0.0084373 -0.0558364 -0.3001293 0.0130956 0.0075045 0.0118911 -0.1239261 -0.564694 0.2716013 -0.0193829 0.4694676 -1.1607049 0.0518175 -0.0343743 0.053091 -0.4314735 -1.1513318 -0.2757343 0.0271311 -0.1199034 -0.6845966 0.0296056 0.0151573 0.0307308 -0.3073081 -0.1747692 -0.119415 0.009172 -0.5903647 -0.0518595 -0.0023177 0.0432554 -0.00586 -0.1426455 -0.1146503 -0.0364653 0.0039406 -0.0930065 -0.0441465 0.0063851 0.0092704 0.0058782 0.0345741 1.1213151 -0.0036375 -0.0073843 0.1300819 0.208294 -0.0076726 -0.0163067 -0.0069774 0.1151594 0.7551919 0.0352478 -0.0088942 -0.0167391 0.1061077 -0.0151718 -0.0056671 -0.0154163 -0.1016882 -0.6725553 -0.0258154 0.0055989 0.3617057 0.0811347 -0.02176 -0.0233822 -0.0187486 -0.1771105 -0.7143725 -0.0695861 0.0089818 0.1523324 -0.071447 -0.0096563 -0.0069535 -0.0080609 -0.1894113 -0.036781 -0.0706142 0.0037289 0.0736791 0.0086528 -0.0108342 -0.007135 -0.009751 -0.1402631 -0.0427058 0.1045162 -0.0085493 -0.0958328 0.0673145 -0.0157873 0.0058332 -0.017251 -0.1632341 -0.1631561 0.1863843 -0.0117776 0.5241202 0.0012016 0.0032308 -0.0366028 0.0054884 0.0916033 -0.1817203 0.082318 -0.0056555 0.2308916 0.1169972 -0.0203923 -0.0158974 -0.0193189 -0.1445028 0.0152402 -0.1396811 0.008615 -0.2541546 0.0342375 -0.010595 0.0166357 -0.0114201 -0.1416726 -0.0005305 0.0265958 -0.0035318 -0.0536503 -0.0271196 -0.0087918 0.0022055 -0.0093649 -0.1552426 2.118893 -0.0627359 -0.009284 -0.3337582 1.522986 -0.0928099 0.0111378 -0.0944198 0.2686215 0.0704428 -0.0044008 0.0009913 -0.087805 -0.0332112 0.0143428 0.0067684 0.0136148 0.1539175 0.0391395 -0.0294422 0.0030851 -0.0743695 -0.0532135 0.0168108 0.0064295 0.016411 0.1676874 0.1726442 -0.0122839 0.0011412 -0.0387073 0.0520731 0.0115297 0.0031066 0.0113849 0.2066014 0.0248438 0.113323 -0.0068165 0.081115 -0.0183998 0.010746 -0.0046191 0.010501 0.144092 0.0708806 -0.0906544 0.0071831 -0.0565552 -0.0609804 0.0158092 0.0047004 0.0160612 0.1539163 0.0339042 -0.0602105 0.0053155 -0.108077 -0.0899885 0.0184531 0.0088437 0.0180554 0.1572399 -0.0267561 0.0955335 -0.0052446 0.1298179 -0.0326502 0.0126882 -0.0076603 0.0129768 0.1597894 -0.1300636 -0.0315565 0.0047884 -0.0376912 0.0868977 0.0057001 0.005245 0.0056736 0.162249 0.1324306 -0.0436867 0.0052852 -0.1367601 0.3425501 0.0055745 0.012505 0.0048307 0.4030272 unknown
polarizability: 346.7913903|-3.8125075|138.9687826|-1.9081581|-5.8585547|57.763629 unknown
InChI: InChI=1S/C12H9NO3/c14-12(15)11-8-10(16-13-11)7-6-9-4-2-1-3-5-9/h1-8,14H
charge 0 multiplicity 1
25 atoms
O  1.453981 1.248915 -0.149195
O  5.045928 -1.546559 0.03183
O  5.73069 0.675327 -0.140406
N  2.900571 1.383985 -0.169106
C  -2.757189 0.120728 -0.036574
C  1.10791 -0.121272 -0.046775
C  -1.32089 0.418709 -0.068694
C  -0.289301 -0.486314 -0.010059
C  2.286892 -0.861905 -0.002167
C  -3.284615 -1.201579 0.061241
C  -3.676047 1.208617 -0.106202
C  3.348647 0.097571 -0.07896
C  -4.674719 -1.420933 0.088843
C  -5.068338 0.988685 -0.078662
C  -5.574572 -0.32804 0.019343
C  4.810077 -0.162811 -0.070387
H  -1.054637 1.481907 -0.147981
H  -0.479823 -1.562415 0.06991
H  2.402893 -1.93861 0.074842
H  -2.607157 -2.061053 0.115629
H  -3.28638 2.231224 -0.182057
H  -5.063237 -2.442551 0.164491
H  -5.756615 1.839005 -0.133346
H  -6.655674 -0.503322 0.041369
H  6.028507 -1.70491 0.036573
