program: Gaussian 09
title: 000249412
version: EM64L-G09RevD.01
frameworkgroup: C1[X(C12H6F4)]
method: RPBEPBE
basis: SDD
operation: Freq
keyword: #pfreq=noraman
keyword: PBEPBE/SDD
title: #p freq=noraman PBEPBE/SDD
converged: YES YES YES YES
title: Mulliken charges:
elementType: F F F F C C C C C C C C C C C C H H H H H H
charge: -0.193357 -0.193357 -0.194669 -0.194669 0.198612 0.198613 0.211502 0.211501 -0.285848 -0.285848 -0.519826 -0.519826 -0.397444 -0.397444 0.368867 0.368867 0.264620 0.264620 0.284390 0.284390 0.263154 0.263154
chargesum: 0.00000
title: Mulliken charges with hydrogens summed into heavy atoms:
elementType: F F F F C C C C C C C C C C C C
charge: -0.193357 -0.193357 -0.194669 -0.194669 0.198612 0.198613 0.211502 0.211501 -0.021228 -0.021228 -0.235436 -0.235436 -0.134291 -0.134290 0.368867 0.368867
polarizability: 2.06921093e+02 5.15668597e+00 1.23415280e+02 -3.48764486e-04 -6.21718600e-03 6.10545369e+01
1716.lowfreq: -6.7279 -4.1661 -0.0002 0.0008 0.0009 1.8628 45.7461 57.2410 78.4538
frequency: 45.7460 57.2409 78.4536 160.1638 203.4386 218.9427 221.2666 235.0674 310.6134 312.5919 326.8946 387.6385 449.1889 453.3948 476.8799 490.6745 496.9252 524.1456 568.0064 598.7384 604.7619 649.0467 699.2046 712.5671 714.1611 729.9237 808.3475 821.9729 852.5006 852.6556 921.2970 939.8461 947.1760 949.2163 992.5207 1078.9125 1093.1580 1134.2623 1145.4215 1200.0347 1215.4670 1256.2780 1263.0901 1303.5042 1347.0627 1373.8183 1410.5400 1422.9671 1472.7257 1514.1273 1582.8751 1594.2734 1621.9589 1622.2078 3173.5706 3173.5877 3192.0649 3192.1412 3195.6602 3195.7365
redmass: 13.2197 6.2137 9.2021 8.5298 7.6647 7.1292 9.3000 10.0250 13.6147 9.7328 10.1823 5.8162 3.1169 4.1726 4.4152 7.1550 9.4623 9.9670 6.5711 4.4260 3.6696 6.1602 3.8400 7.6098 6.2306 3.1600 1.3384 1.5491 1.5744 1.5864 4.6648 5.0782 1.3355 1.3465 7.4859 2.1461 1.5829 1.7116 1.4130 2.5767 2.8328 1.5510 1.9767 2.5500 5.6499 11.6194 5.1412 4.3558 2.7330 3.6703 8.4614 8.8313 7.3926 7.9681 1.0889 1.0890 1.0969 1.0970 1.0944 1.0945
irintensity: 0.1494 0.9476 0.4490 0.4367 0.3195 0.2062 1.2977 0.7167 9.5485 0.2048 1.4555 0.0182 10.1573 2.7072 1.7255 0.0412 33.6350 13.2203 0.2812 13.0105 2.4537 0.1526 3.6835 8.5118 0.3856 0.0667 38.0026 2.1527 14.2673 112.1367 127.5594 5.6237 0.0506 0.5017 8.3587 9.6720 55.1005 49.7069 0.0898 5.3228 76.6378 27.9663 1.1464 0.4364 32.0256 0.3597 15.0894 4.0779 239.2215 4.0548 65.4859 12.0364 158.9437 0.0014 3.7103 0.1737 1.1313 0.2235 2.8159 0.4881
temp: 298.150 k
press: 1.00000 atm
elementType: 9 9 9 9 6 6 6 6 6 6 6 6 6 6 6 6 1 1 1 1 1 1
symmnumber: 1
zpe: 380332.7 jmol-1
zpe.correction: 0.144861 hartree
zpe.thermalcorrener: 0.157616 hartree
zpe.thermalcorrenthalpy: 0.158561 hartree
zpe.thermalcorrgfe: 0.105001 hartree
zpe.sumelectzpe: -859.137737 hartree
zpe.sumelectthermal: -859.124982 hartree
zpe.sumelectthermalent: -859.124037 hartree
zpe.sumelectthermalfe: -859.177597 hartree
dipole: 0.0000 -0.0001 -1.2581
dipole: 1.2581
quadrupole: -100.9136 -83.9786 -90.4519
quadrupole: 0.0023 0.0000 -0.0006
quadrupole: -9.1322 7.8027 1.3295 0.0023 0.0000 -0.0006
hfenergy: -859.282598 hartree
pointgroup: C01 [X(C12H6F4)]
dipole: 0.000001 -0.0000503 0.4949849 debye
dipolederiv: -0.3603222 0.2268579 0.1127608 0.2023776 -0.7249486 -0.25261 0.0553188 -0.2467997 -0.2346876 -0.3603238 0.2268809 -0.1127149 0.2023898 -0.7250484 0.2525109 -0.0552777 0.2467008 -0.2345871 -1.3117235 0.0290602 0.0194359 0.0087206 -0.2032723 -0.0229181 0.0225624 -0.019549 -0.1549361 -1.3117236 0.0290638 -0.0194287 0.0087241 -0.2032807 0.0229083 -0.0225599 0.0195394 -0.1549274 0.2033474 -0.0295526 -0.0164191 0.0501732 -0.212452 -0.0347265 0.0673773 -0.0471291 -0.05052 0.2033483 -0.0295557 0.0164127 0.0501856 -0.2124685 0.0346942 -0.0673671 0.0470966 -0.0505032 0.4844387 -0.1794081 -0.1046477 -0.1445355 0.806899 0.3200923 -0.0816374 0.2984596 0.2173243 0.484439 -0.1794297 0.1046113 -0.1445534 0.8070223 -0.3199732 0.0816077 -0.2983407 0.2171995 0.0974258 -0.0235345 -0.0161666 -0.044161 0.0847899 0.0755998 -0.0106115 0.0457603 -0.0653769 0.0974253 -0.0235378 0.0161616 -0.0441631 0.0848143 -0.0755702 0.0106023 -0.0457304 -0.0654011 -0.3859664 0.1048241 0.0493659 0.1471553 -0.1814858 -0.0158279 0.0755968 -0.009108 -0.1676149 -0.385966 0.1048339 -0.0493448 0.147171 -0.18149 0.0158245 -0.0755671 0.0091051 -0.1676096 -0.3434935 -0.0442204 -0.0122536 -0.2230909 -0.0708746 0.0343126 -0.1045292 0.0335322 -0.1582811 -0.3434932 -0.0442229 0.0122451 -0.2231117 -0.0708605 -0.034295 0.1044841 -0.033514 -0.158295 1.4143156 -0.0383489 -0.0281111 0.0333183 0.3621642 0.096242 -0.0092267 0.0938173 0.1372723 1.4143157 -0.0383546 0.0281016 0.0333169 0.3622019 -0.0961966 0.0092328 -0.093772 0.1372342 0.0761968 -0.0647642 -0.0255437 -0.0586645 0.0374007 -0.0474586 -0.0337281 -0.0326369 0.1249561 0.0761966 -0.064769 0.0255308 -0.0586711 0.0373843 0.0474414 0.0337161 0.0326196 0.124972 0.0782407 -0.0277317 -0.0116614 -0.0344466 0.0691994 -0.0498754 -0.009457 -0.0480432 0.1860115 0.0782405 -0.0277339 0.0116561 -0.0344486 0.0691794 0.049852 0.0094502 0.0480196 0.1860311 0.0475409 0.0468196 0.0202777 0.0631547 0.0325744 -0.0574513 0.0220237 -0.0561557 0.165858 0.0475408 0.0468237 -0.020268 0.0631594 0.0325515 0.0574245 -0.0220105 0.0561285 0.1658811 unknown
polarizability: 207.0813113|-3.6313384|123.2550618|-0.000462|0.0062098|61.0545369 unknown
InChI: InChI=1S/C12H6F4/c13-7-1-3-9(11(15)5-7)10-4-2-8(14)6-12(10)16/h1-6H
charge 0 multiplicity 1
22 atoms
F  -0.911607 -2.256329 -0.679133
F  0.911622 2.256477 -0.678681
F  -4.981463 0.116251 0.257259
F  4.981481 -0.116289 0.257229
C  -0.743392 0.024409 0.17796
C  0.74341 -0.024434 0.177954
C  -1.539334 -1.08112 -0.216737
C  1.53935 1.081175 -0.216522
C  -1.455847 1.182207 0.602513
C  1.455866 -1.182316 0.602275
C  -2.942388 -1.085451 -0.204641
C  2.942405 1.085504 -0.204428
C  -2.863676 1.229633 0.635116
C  2.863695 -1.229748 0.634867
C  -3.577539 0.088769 0.229766
C  3.577557 -0.088803 0.229743
H  -0.889655 2.061389 0.918705
H  0.889676 -2.061562 0.918293
H  -3.508343 -1.961995 -0.527922
H  3.508359 1.962114 -0.527534
H  -3.397412 2.123897 0.966125
H  3.397432 -2.124078 0.965696
