program: Gaussian 09
title: 000249407
version: EM64L-G09RevD.01
frameworkgroup: C1[X(C10H5F2NO2)]
method: RPBEPBE
basis: SDD
operation: Freq
keyword: #p
keyword: freq=noraman
keyword: PBEPBE/SDD
title: #p freq=noraman PBEPBE/SDD
converged: NO NO NO NO
title: Mulliken charges:
elementType: F F O O N C C C C C C C C C C H H H H H
charge: -0.175750 -0.191785 -0.245556 -0.146143 -0.036761 0.087343 0.303927 -0.281881 0.155459 -0.494528 -0.366802 0.367217 -0.247379 -0.266058 0.156163 0.266280 0.286878 0.265971 0.281596 0.281809
chargesum: 0.00000
title: Mulliken charges with hydrogens summed into heavy atoms:
elementType: F F O O N C C C C C C C C C C
charge: -0.175750 -0.191785 -0.245556 -0.146143 -0.036761 0.087343 0.303927 -0.015601 0.155459 -0.207650 -0.100831 0.367217 0.034217 0.015750 0.156163
polarizability: 2.51012195e+02 -9.93477641e+00 1.16162613e+02 2.57039038e+00 1.38546036e+00 6.17550438e+01
1716.lowfreq: -12.6354 -7.7752 -6.0719 -0.0010 -0.0003 0.0006 35.4434 64.7649 68.0015
frequency: 35.4321 64.7567 67.9851 143.6870 169.0841 220.2419 240.0767 278.5882 310.3062 323.7781 405.6462 429.0402 464.9907 485.4550 526.4213 540.7295 588.0774 611.5248 629.7938 678.1018 701.2205 706.3732 711.0772 768.3247 798.9665 815.1060 818.2963 849.9428 851.6967 936.5985 944.4747 945.6542 1029.5881 1055.5243 1082.2873 1131.6676 1176.6949 1189.1780 1247.9116 1258.5262 1322.8547 1361.3090 1422.4033 1475.3397 1567.8961 1576.5711 1609.0794 1664.9854 1723.3151 3169.7692 3190.6982 3193.8595 3217.4573 3243.4403
redmass: 11.3096 5.9352 8.3740 9.4926 11.6769 7.7650 7.4915 8.0729 8.7858 7.8213 5.7157 5.3975 4.1367 6.7961 6.6268 7.2733 4.9040 4.6152 5.0401 8.3644 5.7242 6.0747 4.3273 7.2043 4.6619 1.6416 1.6865 3.5898 1.9882 3.0297 1.5611 1.3272 2.2316 1.7009 1.9783 1.5383 3.2444 2.3352 1.4727 3.6136 2.4379 8.7427 4.8165 3.3102 6.5250 8.9570 7.4626 11.6462 12.3962 1.0892 1.0970 1.0945 1.0905 1.1096
irintensity: 2.1244 3.0114 0.9347 2.8199 5.7282 0.7119 2.2724 6.9164 2.7971 1.7222 4.0138 10.6702 4.9146 0.8937 26.9672 3.9494 5.7110 8.5807 3.7836 56.7934 5.0846 3.3629 32.7873 91.8455 44.6901 74.4306 26.7079 57.1694 33.3325 35.4579 5.2830 0.3692 60.8146 35.9230 31.8540 20.9860 46.9538 41.0677 4.1482 50.6641 2.9533 5.3517 13.1580 80.7427 51.9072 32.8046 92.2315 166.3417 360.3920 1.1644 1.5940 2.4309 1.4482 0.0384
temp: 298.150 k
press: 1.00000 atm
elementType: 9 9 8 8 7 6 6 6 6 6 6 6 6 6 6 1 1 1 1 1
symmnumber: 1
zpe: 334785.7 jmol-1
zpe.correction: 0.127513 hartree
zpe.thermalcorrener: 0.139548 hartree
zpe.thermalcorrenthalpy: 0.140492 hartree
zpe.thermalcorrgfe: 0.088088 hartree
zpe.sumelectzpe: -787.875765 hartree
zpe.sumelectthermal: -787.863730 hartree
zpe.sumelectthermalent: -787.862786 hartree
zpe.sumelectthermalfe: -787.915191 hartree
dipole: 0.5721 4.1551 0.8620
dipole: 4.2820
quadrupole: -80.1025 -82.9832 -85.8370
quadrupole: 9.5380 5.8172 -4.4852
quadrupole: 2.8718 -0.0090 -2.8628 9.5380 5.8172 -4.4852
hfenergy: -788.0032782 hartree
pointgroup: C01 [X(C10H5F2N1O2)]
dipole: 0.3478927 0.8193903 -1.4302561 debye
dipolederiv: -0.2606652 -0.1614407 -0.2886045 -0.0866061 -0.1991303 -0.1878288 -0.1014351 -0.1949619 -0.6079115 -1.3351161 -0.2278211 0.1175845 -0.3384145 -0.2081329 0.0268335 0.267684 0.0417856 -0.2367874 -1.1710629 0.1501653 -0.3288493 0.1811047 -0.4540526 0.3550546 -0.5383625 0.3520782 -0.5574971 -0.7046337 0.1051635 -0.174597 0.6137506 -0.5890398 0.3788443 -0.6734931 0.3200766 -0.7231598 -0.1243644 0.02884 -0.1381641 0.1849609 -0.308665 0.0976446 0.1573109 0.1472719 -0.4007474 0.1265959 0.0776914 0.0130031 -0.1434346 0.0212585 -0.025522 -0.062008 -0.0732027 -0.1122352 0.3913535 0.1911909 0.2416647 0.3611279 0.2286839 0.193714 -0.1377719 0.2697943 0.693886 0.3326178 0.0806279 0.0263286 -0.095567 -0.0963144 0.0275316 0.1601098 -0.0226995 0.1314957 0.1168077 -0.1082541 0.1737932 -0.5244691 0.4739603 -0.3476555 0.4044509 -0.386106 0.5871281 -0.4543606 -0.0664579 -0.078845 -0.1211895 -0.1755146 -0.0425288 -0.162308 -0.0302139 -0.1177876 -0.3757367 0.0025944 0.0346475 0.0163909 -0.1707735 0.0267361 0.451475 0.0631783 -0.1119755 1.3918262 0.2886609 -0.1151457 0.3712364 0.1906231 -0.0065505 -0.3612542 -0.0316994 0.4175053 0.5928875 -0.0354452 0.0876427 0.0889696 -0.0155708 -0.1247997 0.1532823 -0.1153475 0.0279961 -0.0949418 -0.0220374 0.0426582 0.3537465 -0.2587789 0.1403904 -0.4343433 0.1187383 -0.3048637 1.1983006 -0.1744357 0.359857 -0.7188885 0.7779868 -0.5872117 0.8617083 -0.5431357 0.9849407 0.0978167 -0.0270691 0.0633776 -0.0163892 0.1551577 0.0049762 0.0339379 0.0003167 -0.0024211 0.0978373 -0.0206951 0.0185379 -0.0490449 0.1926269 -0.0169237 0.0299608 -0.0092193 0.0465665 0.0263091 -0.0416181 -0.0580386 -0.0331212 0.1744831 -0.0296758 -0.0634398 -0.0270596 0.0429151 0.121562 -0.0075833 -0.0047101 -0.0283765 0.1071117 0.0755574 0.0321688 0.0795668 0.0927086 0.0269669 -0.0320767 0.0078592 -0.0157864 0.1540808 0.0414138 -0.017673 0.0408386 0.1502441 unknown
polarizability: 247.4218298|5.8004553|67.5371681|24.3463086|-15.9381631|113.9708543 unknown
InChI: InChI=1S/C10H5F2NO2/c11-6-1-2-8(7(12)5-6)13-9-3-4-10(14)15-9/h1-5H
charge 0 multiplicity 1
20 atoms
F  -0.351419 0.68753 1.729027
F  -4.670385 -0.799647 0.228454
O  1.855454 -0.560523 0.626282
O  3.712323 -1.40014 1.819672
N  0.603911 0.712932 -1.021363
C  -0.690667 0.304765 -0.651756
C  -1.185616 0.274945 0.685446
C  -1.615592 -0.002939 -1.689811
C  1.714807 0.386503 -0.440381
C  -2.503934 -0.080568 1.001941
C  -2.937803 -0.39261 -1.410138
C  -3.350842 -0.427125 -0.064666
C  3.054666 0.883422 -0.79943
C  3.97979 0.293342 0.014982
C  3.28798 -0.644566 0.939971
H  -1.256305 0.054944 -2.7208
H  -2.853281 -0.083604 2.037119
H  -3.63896 -0.653244 -2.206631
H  3.209506 1.612337 -1.593647
H  5.059666 0.431543 0.034728
