program: Gaussian 09
title: 000249402
version: EM64L-G09RevD.01
frameworkgroup: C1[X(C12H12N2O2)]
method: RPBEPBE
basis: SDD
operation: Freq
keyword: #p
keyword: freq=noraman
keyword: PBEPBE/SDD
title: #p freq=noraman PBEPBE/SDD
converged: YES YES NO NO
title: Mulliken charges:
elementType: O O N N C C C C C C C C C C C C H H H H H H H H H H H H
charge: -0.223585 -0.181328 -0.148682 0.042145 0.413476 -0.348965 -0.325678 0.201746 -0.338139 -0.374630 -0.644462 -0.645818 0.057251 -0.244819 -0.310915 0.134992 0.240788 0.244068 0.243629 0.261253 0.241544 0.240551 0.221401 0.240832 0.222998 0.238143 0.271080 0.271122
chargesum: 0.00000
title: Mulliken charges with hydrogens summed into heavy atoms:
elementType: O O N N C C C C C C C C C C C C
charge: -0.223585 -0.181328 -0.148682 0.042145 0.413476 -0.108177 -0.081611 0.201746 -0.094510 -0.113377 0.059035 0.056155 0.057251 0.026261 -0.039793 0.134992
polarizability: 4.50393171e+02 1.63642645e+01 1.33193345e+02 4.92245418e+00 3.82441144e-01 7.51676044e+01
1716.lowfreq: -3.9239 -2.6314 -0.0008 -0.0007 -0.0006 6.2908 35.9482 46.0734 65.5264
frequency: 35.9146 46.0670 65.5137 88.8546 110.5945 129.8610 172.7256 196.6852 215.2814 230.6319 266.6883 294.6925 329.8411 397.3699 412.0050 427.9925 470.3068 483.6162 530.5561 549.7648 597.2689 616.6867 659.6640 677.7864 699.2082 717.6144 731.5013 776.4537 796.7316 807.5789 825.2047 841.5391 879.2303 926.0194 938.7791 945.0078 961.6371 988.9074 1042.5727 1056.1698 1062.4562 1104.3153 1111.3363 1128.2970 1165.3280 1176.2538 1196.9026 1250.9336 1256.0113 1309.8671 1317.0564 1364.0549 1368.4329 1431.5273 1454.4913 1457.7326 1465.6169 1477.9995 1491.3882 1499.8579 1519.2652 1531.8304 1543.3458 1592.0252 1639.8999 1691.9218 2947.9611 2955.0069 3018.2102 3020.8436 3102.4361 3112.4427 3136.5193 3155.3494 3166.2475 3177.9903 3207.2088 3233.1880
redmass: 4.7164 6.0661 3.0878 3.1457 2.7391 1.8000 3.6539 1.2083 3.2392 7.2687 3.4430 4.3515 4.6875 4.0465 5.9342 3.2528 4.0038 4.1924 2.3478 4.5118 3.7281 6.6612 7.6527 5.8438 5.8002 6.4149 3.9393 6.9905 1.3395 1.5504 1.8312 7.3407 7.4998 1.3433 2.4331 1.4875 1.3449 2.8397 2.4430 1.5052 1.5149 1.2370 1.3285 1.4459 1.6838 2.4578 1.4588 2.5808 2.8755 1.4852 1.9454 4.0288 3.2434 1.2126 3.0355 1.2173 1.0404 1.0467 1.1316 1.3549 1.9733 6.1184 5.3967 8.5333 7.5271 11.9533 1.0374 1.0395 1.0988 1.1026 1.0967 1.0947 1.0880 1.0878 1.0942 1.0962 1.0895 1.1076
irintensity: 1.8882 2.4719 1.4351 1.6246 7.2949 0.3047 0.8451 0.9768 0.4645 0.3210 4.1773 6.0215 4.6831 1.0490 6.7347 11.8779 0.9822 5.4610 19.8215 23.8566 7.8365 2.4909 8.2361 18.2936 0.7295 7.9971 12.0562 61.0736 40.1208 48.0369 72.9401 70.0401 1.7220 1.7263 21.3238 13.2302 1.0817 1.2377 34.8620 24.8966 26.8713 0.9189 2.9656 11.7250 0.9563 414.0603 8.5532 5.3567 27.8600 3.3740 4.1154 4.6417 283.1743 7.5838 1.7122 40.5700 0.3553 24.7680 3.1138 47.8408 105.4310 90.0437 320.0954 391.6762 305.3360 763.6025 86.4107 179.6061 2.4102 72.9713 3.8033 44.3033 3.9891 4.1735 15.8142 16.4167 0.3877 0.8157
temp: 298.150 k
press: 1.00000 atm
elementType: 8 8 7 7 6 6 6 6 6 6 6 6 6 6 6 6 1 1 1 1 1 1 1 1 1 1 1 1
symmnumber: 1
zpe: 566922.7 jmol-1
zpe.correction: 0.215929 hartree
zpe.thermalcorrener: 0.230573 hartree
zpe.thermalcorrenthalpy: 0.231517 hartree
zpe.thermalcorrgfe: 0.173299 hartree
zpe.sumelectzpe: -723.244745 hartree
zpe.sumelectthermal: -723.230102 hartree
zpe.sumelectthermalent: -723.229158 hartree
zpe.sumelectthermalfe: -723.287376 hartree
dipole: -10.6602 4.2427 1.7083
dipole: 11.6000
quadrupole: -100.5041 -86.5164 -95.8676
quadrupole: 11.0245 4.8938 -2.2068
quadrupole: -6.2080 7.7796 -1.5716 11.0245 4.8938 -2.2068
hfenergy: -723.4606746 hartree
pointgroup: C01 [X(C12H12N2O2)]
dipole: -4.2139746 0.5654702 -1.6585439 debye
polarizability: 449.3563097|-8.9276417|76.3786192|-23.2679292|8.3031819|133.0191916 unknown
InChI: InChI=1S/C12H12N2O2/c1-14(2)10-5-3-9(4-6-10)13-11-7-8-12(15)16-11/h3-8H,1-2H3
charge 0 multiplicity 1
28 atoms
O  3.584554 -0.176128 0.861175
O  5.793053 -0.145693 0.031065
N  -4.269897 0.310489 -0.142741
N  1.264045 0.002412 1.076492
C  -2.906857 0.222171 0.133769
C  -1.982885 -0.29335 -0.836524
C  -2.37784 0.615203 1.409049
C  -0.080623 0.062881 0.694189
C  -0.609863 -0.35926 -0.56676
C  -1.009509 0.512066 1.680601
C  -5.203906 0.778524 0.892196
C  -4.786602 -0.103009 -1.455371
C  2.293644 0.070723 0.2843
C  2.497789 0.439459 -1.126421
C  3.84205 0.41852 -1.403167
C  4.579778 0.015994 -0.183943
H  -2.346572 -0.668254 -1.797146
H  -3.043076 0.988929 2.191504
H  0.05336 -0.810069 -1.313498
H  -0.611196 0.79504 2.659913
H  -5.182794 0.127826 1.789373
H  -4.972134 1.81356 1.213004
H  -6.229072 0.770199 0.491319
H  -4.308713 0.465855 -2.276952
H  -5.87001 0.086968 -1.499175
H  -4.622088 -1.183655 -1.643952
H  1.692142 0.73658 -1.796895
H  4.349418 0.67062 -2.333607
