program: Gaussian 09
title: 000249394
version: EM64L-G09RevD.01
frameworkgroup: C1[X(C20H13Cl2N)]
method: RPBEPBE
basis: SDD
operation: Freq
keyword: #p
keyword: freq=noraman
keyword: PBEPBE/SDD
title: #p freq=noraman PBEPBE/SDD
converged: YES YES NO NO
title: Mulliken charges:
elementType: Cl Cl N C C C C C C C C C C C C C C C C C C C C H H H H H H H H H H H H H
charge: -0.064692 -0.061701 -0.075613 -0.692196 0.301449 0.189539 0.287424 0.193028 -0.573979 -0.391219 -0.402701 -0.382725 0.247039 -0.350643 -0.101338 -0.224410 -0.357928 0.506300 -0.280871 -0.363770 -0.233144 -0.228919 -0.217437 0.250718 0.250501 0.267159 0.239816 0.267890 0.245470 0.243640 0.255309 0.242303 0.284051 0.258310 0.235559 0.237780
chargesum: 0.00000
title: Mulliken charges with hydrogens summed into heavy atoms:
elementType: Cl Cl N C C C C C C C C C C C C C C C C C C C C
charge: -0.064692 -0.061701 -0.075613 -0.190976 0.301449 0.189539 0.287424 0.193028 -0.306820 -0.151402 -0.134811 -0.137255 0.247039 -0.107004 -0.101338 0.030899 -0.115625 0.506300 -0.280871 -0.079718 0.025166 0.006640 0.020343
polarizability: 6.01947839e+02 -1.89717930e+01 2.29517929e+02 -4.34205957e+00 -8.77916419e+00 1.05138484e+02
1716.lowfreq: -3.8273 -0.0023 -0.0019 -0.0018 0.9064 6.2674 19.3761 24.7503 36.7298
frequency: 18.8838 24.5948 36.7078 61.7455 105.0005 110.0785 138.7569 150.8721 156.7456 185.0914 196.5055 242.0427 256.6090 269.7443 293.6673 305.9017 372.8027 379.1264 388.1192 422.8240 441.1995 454.7918 472.4396 488.0933 507.6226 528.5256 534.2195 562.3018 579.7620 600.8745 636.0561 670.3646 682.5406 704.6255 726.8684 733.2177 758.3620 768.0640 769.7148 818.9047 832.6738 852.6246 856.8173 867.8683 879.4051 901.0668 925.4903 950.9660 953.9695 962.3627 966.6269 979.4746 993.6024 1004.2621 1013.4146 1035.2962 1061.9149 1098.4640 1114.7420 1126.2726 1134.7948 1146.8424 1169.6426 1181.5919 1199.2763 1201.6429 1226.2184 1249.4828 1277.0363 1280.3110 1302.3417 1341.8633 1364.5352 1374.4821 1390.1237 1418.1924 1425.1672 1426.2590 1442.7143 1452.3250 1462.5774 1485.4827 1558.0769 1568.1009 1578.7948 1581.0546 1604.6343 1611.7649 1631.2029 2986.8650 3008.7022 3032.0558 3128.7547 3138.7499 3141.1331 3149.9758 3152.7077 3153.1015 3158.8321 3165.5345 3172.9228 3177.2528
redmass: 8.5283 5.5381 7.4320 7.8118 5.4344 7.1757 4.9239 7.1402 5.0055 4.9315 7.9387 2.2681 3.4922 6.7500 6.1842 6.8733 7.2956 7.4890 6.3350 2.7386 3.0690 3.3106 5.1179 7.8112 3.5197 3.8833 3.9527 5.6589 6.7871 3.1757 6.6853 7.0419 6.5434 3.4766 3.7117 5.7670 2.8547 1.3017 5.8302 1.4672 1.8076 5.0740 2.9718 1.4413 1.3434 1.4631 3.3392 1.4201 1.4289 1.3991 1.8715 1.6392 5.7628 1.3752 7.0133 2.0043 1.9869 2.2110 1.8018 1.6339 1.1482 1.4257 1.0661 2.1205 1.6660 2.3780 1.6953 1.8324 1.7660 1.4451 2.2947 2.2113 4.5214 5.7209 3.0649 3.2092 1.8963 1.4340 3.0122 3.0126 3.1138 3.9407 6.4138 6.8210 6.6059 7.2881 7.2408 7.7212 7.5049 1.0610 1.0871 1.0994 1.0872 1.0860 1.0897 1.0946 1.0904 1.0944 1.0932 1.0957 1.0960 1.0997
irintensity: 0.2967 0.4029 0.2406 0.8589 0.9179 1.1517 1.5430 0.0519 2.2704 8.7095 1.0595 11.2181 19.3047 4.0361 0.1278 1.7770 13.1367 4.2390 7.2746 9.7674 2.7576 14.9177 2.3435 2.7588 3.0978 2.4729 2.7780 3.2155 25.8899 1.1701 5.2930 4.1306 21.7232 7.4880 8.2580 6.2911 14.2279 61.7894 2.1703 85.6737 5.0995 41.4494 3.6800 19.2720 0.3237 3.0762 6.8173 2.6882 2.2399 1.1026 19.7954 13.0647 13.8986 3.9479 52.8061 8.4588 37.8778 13.5899 1.9780 3.1712 0.2227 2.9676 4.2170 31.8524 4.5754 0.7414 0.8994 8.3920 33.0954 0.1821 7.5346 7.9614 4.2918 10.2214 5.9191 40.4539 12.9481 54.6460 10.4281 57.0036 27.1871 7.9452 6.4502 0.7818 8.4816 36.4281 5.9519 11.1574 8.4857 10.3226 33.4109 5.7849 11.4350 1.5513 5.5852 14.6597 5.3387 1.8196 2.9315 10.6014 7.3355 24.3855
temp: 298.150 k
press: 1.00000 atm
elementType: 17 17 7 6 6 6 6 6 6 6 6 6 6 6 6 6 6 6 6 6 6 6 6 1 1 1 1 1 1 1 1 1 1 1 1 1
symmnumber: 1
zpe: 697332.0 jmol-1
zpe.correction: 0.265600 hartree
zpe.thermalcorrener: 0.284312 hartree
zpe.thermalcorrenthalpy: 0.285256 hartree
zpe.thermalcorrgfe: 0.216300 hartree
zpe.sumelectzpe: -1743.257434 hartree
zpe.sumelectthermal: -1743.238722 hartree
zpe.sumelectthermalent: -1743.237777 hartree
zpe.sumelectthermalfe: -1743.306733 hartree
dipole: 2.7404 -0.9499 -0.2875
dipole: 2.9146
quadrupole: -145.4995 -132.5700 -151.4577
quadrupole: -8.4241 -1.0353 -4.7152
quadrupole: -2.3238 10.6057 -8.2820 -8.4241 -1.0353 -4.7152
hfenergy: -1743.5230338 hartree
pointgroup: C01 [X(C20H13Cl2N1)]
dipole: -1.1003829 0.0428184 0.3197344 debye
polarizability: 602.8737461|-2.1708558|113.909087|4.5867997|-33.0189432|219.8214198 unknown
InChI: InChI=1S/C20H13Cl2N/c21-16-5-7-18-14(10-16)9-15-11-17(6-8-19(15)18)23-12-13-3-1-2-4-20(13)22/h1-8,10-12H,9H2
charge 0 multiplicity 1
36 atoms
Cl 8.065556 -0.364543 0.448554
Cl -5.038521 -0.120953 -2.878282
N  -2.063252 0.088091 0.455467
C  2.776626 -0.846407 1.618478
C  1.608069 -0.307861 0.800427
C  2.096429 0.364386 -0.364142
C  3.989054 -0.410438 0.804448
C  3.56688 0.302941 -0.360952
C  0.234801 -0.383857 1.059108
C  1.191268 0.964781 -1.269155
C  5.353231 -0.622872 1.066129
C  4.520654 0.808482 -1.27304
C  -0.686086 0.186967 0.132131
C  -0.192111 0.872353 -1.021836
C  6.283233 -0.106556 0.137617
C  5.896231 0.600851 -1.020641
C  -2.988332 0.036223 -0.473496
C  -4.417682 0.012507 -0.117429
C  -5.44977 -0.057521 -1.090638
C  -4.820898 0.060267 1.250724
C  -6.81444 -0.080771 -0.748804
C  -6.177934 0.037329 1.615464
C  -7.179598 -0.033165 0.615318
H  2.793686 -0.424516 2.642305
H  2.72993 -1.947211 1.730606
H  -0.165923 -0.8766 1.950712
H  1.553868 1.506577 -2.14981
H  5.694406 -1.165941 1.952333
H  4.212621 1.356669 -2.169722
H  -0.898864 1.362448 -1.700943
H  6.656562 0.98051 -1.708906
H  -2.750752 -0.018401 -1.552343
H  -4.022263 0.115106 1.997476
H  -7.57517 -0.134861 -1.532501
H  -6.461574 0.07412 2.672396
H  -8.239534 -0.050938 0.890044
