program: Gaussian 09
title: 000249390
version: EM64L-G09RevD.01
frameworkgroup: C1[X(C15H10ClNO2)]
method: RPBEPBE
basis: SDD
operation: Freq
keyword: #p
keyword: freq=noraman
keyword: PBEPBE/SDD
title: #p freq=noraman PBEPBE/SDD
converged: NO YES NO YES
title: Mulliken charges:
elementType: Cl O O N C C C C C C C C C C C C C C C H H H H H H H H H H
charge: -0.047831 -0.139650 -0.243405 -0.449674 0.303433 0.303175 0.232993 0.205617 -0.311916 -0.538089 -0.390973 0.527580 -0.390805 -0.392193 -0.475195 -0.199996 -0.105808 0.215190 -0.799124 0.353016 0.246959 0.250000 0.301896 0.224367 0.257679 0.312683 0.238281 0.273526 0.238265
chargesum: 0.00000
title: Mulliken charges with hydrogens summed into heavy atoms:
elementType: Cl O O N C C C C C C C C C C C C C C C
charge: -0.047831 -0.139650 -0.243405 -0.136991 0.303433 0.303175 0.232993 0.205617 -0.311916 -0.185073 -0.144014 0.527580 -0.140806 -0.090297 -0.250828 0.057682 -0.105808 0.215190 -0.049052
polarizability: 3.69298598e+02 -1.85806188e+00 1.90326275e+02 6.27812099e-04 4.52863611e-04 7.31947805e+01
1716.lowfreq: -71.1799 -0.3235 -0.0019 -0.0011 0.0009 6.4829 10.1268 33.9520 54.1597
frequency: -71.1792 33.9464 54.1584 79.7823 86.8383 134.0279 148.2615 157.2030 172.4298 217.9001 249.7044 261.9004 310.9211 349.4140 361.4804 379.5609 406.5685 443.3483 472.8280 495.6128 530.2568 551.4993 568.9369 590.0434 594.7368 639.3547 641.3367 671.7328 686.9350 727.2158 754.6844 770.0536 822.2881 834.5854 847.3472 858.6273 921.6833 927.8809 952.0174 958.1881 959.8496 973.6941 986.1355 1015.4763 1032.0076 1054.3242 1083.0868 1118.8124 1146.3077 1170.8271 1213.2355 1221.7721 1254.4906 1274.0555 1287.6916 1357.0450 1364.1540 1376.9786 1413.4277 1437.9716 1448.4829 1463.9121 1468.3795 1484.6221 1509.7234 1591.3996 1595.8708 1601.9068 1621.2325 1636.1912 1642.7120 2988.4438 3073.4906 3115.1505 3139.3484 3142.8298 3149.7162 3168.3682 3172.0548 3190.3786 3519.6637
redmass: 1.0506 8.3272 6.2258 4.9663 7.0744 4.0817 6.8205 8.9076 5.7407 11.5862 5.3278 5.4100 6.7213 6.6449 6.1115 4.7475 3.3826 3.5361 5.5610 4.2451 5.4549 5.7829 3.0809 6.7105 3.0312 7.4634 1.2116 6.6180 3.9982 6.2913 6.3474 3.4277 2.5506 1.6849 1.7276 6.0810 1.5246 6.4522 1.4302 1.3917 2.9526 1.5042 2.5048 2.9046 1.6644 1.8756 3.6195 1.9842 1.6532 2.1878 1.7142 2.8080 1.5258 1.7340 2.3333 4.5178 4.8646 1.2401 3.7662 2.3174 1.2031 5.4611 1.0467 3.9287 1.9526 8.5069 7.6540 7.1463 7.7919 6.1462 7.8289 1.0385 1.0984 1.0889 1.0979 1.0901 1.0953 1.0934 1.0957 1.0938 1.0765
irintensity: 0.0171 0.4181 7.8484 0.8841 1.3795 0.3653 1.0142 1.7096 0.1229 0.8551 8.0664 0.3154 0.7654 8.5716 7.9235 0.3158 1.9681 0.1790 0.5852 34.4145 3.6010 13.0862 1.0602 21.4709 2.0949 5.4021 62.8356 13.2036 2.5939 0.4267 26.6867 0.0474 79.6813 35.1643 1.5127 3.3834 5.4869 4.2829 1.7451 0.0351 13.6976 27.4684 32.5878 2.1626 7.8493 13.5686 27.8295 26.1878 6.6404 120.4405 5.2017 93.7136 14.8010 40.1176 71.9514 139.0120 1.2158 67.6938 228.7178 53.5198 76.2676 122.7479 20.6794 312.6343 171.5437 7.6566 63.0742 75.4017 45.1774 8.7297 182.0885 8.2427 14.3380 23.6393 6.1938 3.3956 15.3960 0.2910 6.7151 11.8808 14.6013
temp: 298.150 k
press: 1.00000 atm
elementType: 17 8 8 7 6 6 6 6 6 6 6 6 6 6 6 6 6 6 6 1 1 1 1 1 1 1 1 1 1
symmnumber: 1
zpe: 551062.8 jmol-1
zpe.correction: 0.209889 hartree
zpe.thermalcorrener: 0.225106 hartree
zpe.thermalcorrenthalpy: 0.226050 hartree
zpe.thermalcorrgfe: 0.166413 hartree
zpe.sumelectzpe: -1241.587526 hartree
zpe.sumelectthermal: -1241.572308 hartree
zpe.sumelectthermalent: -1241.571364 hartree
zpe.sumelectthermalfe: -1241.631001 hartree
dipole: -3.7358 7.7017 -0.0002
dipole: 8.5600
quadrupole: -95.8436 -116.2722 -119.2680
quadrupole: -12.7890 0.0010 0.0008
quadrupole: 14.6176 -5.8109 -8.8067 -12.7890 0.0010 0.0008
hfenergy: -1241.7974143 hartree
pointgroup: C01 [X(C15H10Cl1N1O2)]
dipole: 1.3899476 3.0675459 -0.0038884 debye
polarizability: 369.078608|6.5402846|190.5460349|0.0432601|-0.1609659|73.1950106 unknown
InChI: InChI=1S/C15H10ClNO2/c1-8(18)17-10-3-5-12-11-4-2-9(16)6-13(11)15(19)14(12)7-10/h2-7,17H,1H3
charge 0 multiplicity 1
29 atoms
Cl -6.14675 -0.812753 0.000661
O  -0.604856 -2.658002 0.004274
O  4.361127 -1.677136 0.003593
N  3.924522 0.631246 0.00054
C  -0.320243 0.938092 -0.000651
C  -1.792384 0.749243 -0.000665
C  0.307547 -0.342976 0.001258
C  -2.066541 -0.651838 0.001242
C  -0.76089 -1.408051 0.002596
C  1.697475 -0.510979 0.001738
C  0.478771 2.094651 -0.002137
C  2.504549 0.666824 0.000231
C  -2.857597 1.667982 -0.002152
C  -3.372856 -1.159935 0.001695
C  1.885154 1.949741 -0.001677
C  -4.189204 1.175141 -0.001726
C  -4.425098 -0.21626 0.000168
C  4.776608 -0.484564 0.002084
C  6.260823 -0.118268 0.001877
H  2.157632 -1.500818 0.003216
H  0.038192 3.097073 -0.003645
H  -2.685462 2.749321 -0.003625
H  -3.560886 -2.237452 0.003181
H  2.515148 2.848833 -0.002841
H  -5.035839 1.868034 -0.002856
H  4.386671 1.544142 -0.000563
H  6.52898 0.471061 -0.89471
H  6.849408 -1.046308 0.003396
H  6.528601 0.473759 0.896799
