program: Gaussian 09
title: 000249387
version: EM64L-G09RevD.01
frameworkgroup: C1[X(C13H8ClNO)]
method: RPBEPBE
basis: SDD
operation: Freq
keyword: #p
keyword: freq=noraman
keyword: PBEPBE/SDD
title: #p freq=noraman PBEPBE/SDD
converged: YES YES NO NO
title: Mulliken charges:
elementType: Cl O N C C C C C C C C C C C C C H H H H H H H H
charge: -0.062382 -0.157851 -0.686520 0.310189 0.282509 0.245358 0.214683 -0.313311 -0.418991 -0.619855 -0.396310 -0.415462 0.666291 -0.370009 -0.216686 -0.235695 0.266519 0.276585 0.245334 0.278274 0.229555 0.235092 0.322632 0.320050
chargesum: 0.00000
title: Mulliken charges with hydrogens summed into heavy atoms:
elementType: Cl O N C C C C C C C C C C C C C
charge: -0.062382 -0.157851 -0.043838 0.310189 0.282509 0.245358 0.214683 -0.313311 -0.152472 -0.343269 -0.150975 -0.137188 0.666291 -0.370009 0.012869 -0.000603
polarizability: 2.88329470e+02 1.51521207e+01 1.81044808e+02 1.11984918e-02 9.49430742e-03 5.88704379e+01
1716.lowfreq: -6.0493 -2.7990 -0.0021 -0.0018 -0.0003 4.4496 74.7591 76.4904 138.2985
frequency: 74.7586 76.4897 138.2959 140.8055 202.0943 220.0318 251.7578 253.3653 308.5108 346.7831 350.1544 410.1138 419.9634 431.7669 470.3978 486.9109 493.0160 525.5878 583.5753 601.6265 615.7475 657.1820 703.9592 721.4293 739.4670 749.2243 776.5376 826.0658 852.5833 884.3601 893.0309 914.0967 965.9114 978.0502 993.9826 1001.1508 1023.3698 1050.4736 1080.7403 1116.1272 1165.5635 1187.1422 1210.6624 1243.9100 1284.2455 1317.8893 1366.7290 1393.5045 1445.5402 1449.5739 1471.2766 1491.9185 1580.0954 1596.9757 1604.5062 1622.4987 1633.7458 1646.6364 3127.8620 3138.1886 3140.8122 3150.6351 3160.5002 3167.0769 3550.9914 3697.6013
redmass: 5.4144 7.6359 7.4520 5.6081 4.7572 5.7390 5.9966 10.6794 7.7721 4.3100 6.0135 1.3978 2.2922 2.8344 1.1884 4.6633 4.0676 6.2908 6.7323 6.9381 5.1167 7.4541 4.7047 6.7289 5.8089 1.6890 2.2504 2.5832 7.3481 1.4025 1.5677 1.9360 1.4747 3.3305 1.3576 4.7100 1.8665 1.7553 2.4157 2.5380 1.2943 2.0252 2.3744 1.3051 1.6089 3.8611 7.2607 3.2465 2.7435 2.7568 6.9200 4.9416 8.2770 6.8695 7.9123 1.8405 4.2488 3.5689 1.0861 1.0923 1.0898 1.0948 1.0928 1.1002 1.0454 1.1037
irintensity: 6.2352 0.0634 1.3809 0.2576 0.0404 0.8632 3.1472 2.5486 5.5353 6.6883 1.0633 111.9838 4.1581 19.3359 179.7619 2.5678 0.0008 1.9734 4.3075 12.8442 0.0054 5.6085 15.0014 4.6543 17.9311 48.1884 44.2297 0.1469 19.3553 14.4056 2.5651 25.1876 6.6788 60.4734 0.0525 21.0356 3.8964 17.7199 29.1824 10.0729 6.1576 29.1770 1.8953 6.1518 4.5062 73.5316 11.4092 8.2272 29.9390 4.8584 196.6592 115.2724 47.8472 55.0412 156.1437 121.6512 110.7940 195.7353 3.8004 7.3884 4.9754 15.6431 1.3827 32.3931 145.4207 36.7941
temp: 298.150 k
press: 1.00000 atm
elementType: 17 8 7 6 6 6 6 6 6 6 6 6 6 6 6 6 1 1 1 1 1 1 1 1
symmnumber: 1
zpe: 455631.1 jmol-1
zpe.correction: 0.173541 hartree
zpe.thermalcorrener: 0.186057 hartree
zpe.thermalcorrenthalpy: 0.187001 hartree
zpe.thermalcorrgfe: 0.134669 hartree
zpe.sumelectzpe: -1089.160774 hartree
zpe.sumelectthermal: -1089.148258 hartree
zpe.sumelectthermalent: -1089.147314 hartree
zpe.sumelectthermalfe: -1089.199646 hartree
dipole: 1.7632 -1.5168 -0.0006
dipole: 2.3258
quadrupole: -78.5033 -96.6636 -103.8088
quadrupole: 17.6717 0.0002 -0.0072
quadrupole: 14.4886 -3.6717 -10.8169 17.6717 0.0002 -0.0072
hfenergy: -1089.3343151 hartree
pointgroup: C01 [X(C13H8Cl1N1O1)]
dipole: -0.6293976 0.6641967 -0.0002398 debye
dipolederiv: -0.6360142 0.3437371 0.000078 0.4287608 -0.4123475 -0.0000613 0.0003475 -0.0002331 -0.062736 -0.5431712 0.0739631 -0.000001 0.1360236 -1.0951492 0.0000619 -0.0000044 0.0002176 -0.3027061 -1.7183492 -0.4830418 -0.0000462 -0.5543026 -0.272527 0.0011799 0.0016808 0.0015209 -0.6957132 -0.3126308 -0.1694753 0.0001031 -0.0291726 -0.1294046 0.0000606 0.0001451 0.0001279 -0.0478143 0.7481278 0.2490555 -0.0000355 0.1554145 0.0834304 -0.000019 -0.0000526 -0.0000123 0.0060041 -0.5557456 0.4402055 -0.0000858 0.1908636 -0.0329925 0.0000054 -0.0000122 -0.0000819 0.0475292 -0.7319998 -0.2807851 0.0000122 -0.0502667 -0.2800198 0.0000427 -0.0000329 0.0000611 0.0273206 1.3248924 -0.0565087 0.0000055 -0.0652959 1.3122551 -0.0001292 -0.0000641 -0.0003778 0.1072409 0.0901378 0.0963534 0.0000521 0.1528984 -0.0138056 0.0000334 0.0002159 -0.0001398 -0.0676305 -0.2201258 -0.3720887 0.000074 0.3577785 0.1392304 -0.0002518 0.0003724 0.0001187 -0.1754876 -0.444873 -0.2254198 0.0000386 -0.250623 0.0155223 -0.0000278 -0.0000252 -0.0000227 -0.1591342 0.2448636 0.0548943 0.0000149 -0.1044206 0.1341606 -0.0000425 0.000035 -0.0000297 -0.1146781 1.4753857 0.6946767 -0.0004082 0.807901 -0.0386476 -0.0005427 -0.0010552 -0.0008208 0.1454128 0.4519408 -0.5286926 -0.0001239 -1.2513893 0.4140471 0.0002598 -0.0012182 0.0004284 -0.1233581 0.1921293 0.1200818 0.000008 0.0841182 0.0881204 0.0000099 0.0000374 -0.0000054 -0.1257958 -0.0267236 -0.0109603 0.000032 -0.0565793 -0.1541554 -0.0000126 0.0000732 -0.0000051 -0.1864379 0.1070227 -0.0363237 -0.0000054 -0.0159346 -0.0259693 -0.0000133 0.0000401 -0.0000625 0.1561623 0.048321 -0.020454 0.000011 -0.0567979 -0.0285088 0.0001198 0.000009 0.0001747 0.1716652 0.0556857 0.0960316 -0.0000225 0.0514566 -0.0595221 0.0000207 -0.000014 0.0000239 0.1553813 0.0707504 0.028779 -0.0000055 0.087944 -0.0184526 0.0000276 -0.000031 0.0000291 0.1588507 -0.0065942 -0.0975365 0.000001 -0.1258205 -0.0490186 0.0000066 -0.0000155 -0.0000035 0.1544049 -0.1392535 0.0045456 -0.0000284 0.0105823 0.0879521 0.0000105 -0.0000459 0.000011 0.1677822 0.2964695 0.0242551 0.0000647 -0.026916 0.1697673 -0.0003067 0.0002589 -0.0001592 0.3786283 0.2297543 0.0547081 0.0002673 0.1237772 0.166035 -0.000432 -0.000644 -0.0007595 0.3851093 unknown
polarizability: 290.2857304|3.9853515|179.0885472|-0.0121059|-0.0083063|58.8704379 unknown
InChI: InChI=1S/C13H8ClNO/c14-11-5-9-7-3-1-2-4-8(7)13(16)10(9)6-12(11)15/h1-6H,15H2
charge 0 multiplicity 1
24 atoms
Cl -4.004422 2.104042 0.000598
O  0.925099 -2.914199 0.000622
N  -4.235732 -0.924093 0.000905
C  -0.231284 0.503457 -0.000106
C  1.24169 0.683723 -0.000072
C  -0.519325 -0.894511 0.000174
C  1.854323 -0.608954 0.000204
C  0.779841 -1.660093 0.000295
C  -1.293027 1.424304 -0.000151
C  -1.823357 -1.39184 0.000356
C  2.044183 1.838432 -0.00004
C  3.248327 -0.765368 0.000303
C  -2.924101 -0.47564 -0.000171
C  -2.60814 0.916762 -0.000186
C  3.456936 1.683451 0.000072
C  4.057314 0.400616 0.000241
H  -1.129395 2.505896 0.000028
H  -2.002388 -2.473068 0.00112
H  1.602593 2.840965 -0.000122
H  3.689885 -1.767506 0.000468
H  4.094759 2.574726 0.000069
H  5.148798 0.312246 0.000382
H  -5.004928 -0.258037 0.002437
H  -4.44145 -1.91861 -0.001129
