program: Gaussian 09
title: 000249361
version: EM64L-G09RevD.01
frameworkgroup: C1[X(C7H6F3N5)]
method: RPBEPBE
basis: SDD
operation: Freq
keyword: #pfreq=noraman
keyword: PBEPBE/SDD
title: #p freq=noraman PBEPBE/SDD
converged: NO NO NO NO
title: Mulliken charges:
elementType: F F F N N N N N C C C C C C C H H H H H H
charge: -0.140157 -0.157167 -0.156778 -0.394652 0.003028 -0.039376 -0.368112 0.012197 0.013776 0.121472 0.224365 -0.101275 -0.413668 0.327078 -0.602344 0.264906 0.351796 0.321824 0.261249 0.261237 0.210603
chargesum: 0.00000
title: Mulliken charges with hydrogens summed into heavy atoms:
elementType: F F F N N N N N C C C C C C C
charge: -0.140157 -0.157167 -0.156778 -0.042856 0.003028 -0.039376 -0.046288 0.012197 0.013776 0.121472 0.224365 -0.101275 -0.148763 0.327078 0.130744
polarizability: 1.37990608e+02 -7.93465059e+00 1.43113707e+02 7.33963937e-03 3.81115484e-03 5.64313161e+01
1716.lowfreq: -19.3556 -8.1232 -4.9589 0.0005 0.0008 0.0010 3.3753 17.4705 81.8163
frequency: -16.8802 16.7443 81.8130 106.3922 122.2740 172.8185 185.8659 239.8981 273.5080 278.0735 312.9787 366.0592 375.4808 472.2940 477.3731 485.9131 506.6044 541.2854 617.7318 633.6677 667.8289 670.4442 704.6162 714.0394 757.3882 796.6267 836.0438 883.1723 912.6123 998.4356 1006.2009 1044.3791 1051.5297 1068.3940 1122.6713 1151.1872 1169.5574 1203.4568 1249.2438 1310.6673 1362.7456 1378.4437 1384.4326 1410.4243 1425.1372 1455.2090 1457.5938 1480.1151 1506.9747 1559.3919 1607.0857 3000.6423 3086.0678 3118.1346 3218.5775 3589.3115 3614.1816
redmass: 1.1424 5.6113 8.2016 3.9969 5.4060 4.6908 5.2422 6.1053 8.7194 10.2035 8.9630 5.5737 10.4106 1.9441 9.3708 2.6090 7.5094 9.6852 3.9160 14.7007 1.3578 7.4679 6.4020 8.9348 9.5890 3.2284 1.8144 7.9833 4.5147 5.4131 12.9968 5.0157 8.8389 3.2930 1.2865 4.2288 2.3182 1.9653 4.5971 1.9563 11.1478 4.5022 4.6727 2.5468 1.8461 1.0396 1.6357 1.4446 1.9443 5.8123 6.0422 1.0337 1.1015 1.1023 1.0978 1.0782 1.0827
irintensity: 0.0671 0.5406 0.0190 2.5273 1.2317 0.3451 1.4338 0.8321 0.5908 3.7647 1.5696 2.6798 2.0617 72.3549 4.5224 32.6204 3.4975 1.9081 11.5053 17.9102 98.4135 16.4943 4.3907 0.2149 5.6625 35.0632 14.4276 87.8475 43.0668 3.1769 240.4916 1.3054 206.0172 105.1511 1.2519 117.4917 7.2168 33.8282 58.6648 11.1083 11.4435 19.2971 80.0998 14.6857 44.4434 15.5428 11.9782 0.4098 13.3193 139.7378 529.6240 45.6051 19.1283 19.6811 1.8169 61.8520 111.7537
temp: 298.150 k
press: 1.00000 atm
elementType: 9 9 9 7 7 7 7 7 6 6 6 6 6 6 6 1 1 1 1 1 1
symmnumber: 1
zpe: 366295.0 jmol-1
zpe.correction: 0.139514 hartree
zpe.thermalcorrener: 0.151692 hartree
zpe.thermalcorrenthalpy: 0.152636 hartree
zpe.thermalcorrgfe: 0.099519 hartree
zpe.sumelectzpe: -842.535981 hartree
zpe.sumelectthermal: -842.523804 hartree
zpe.sumelectthermalent: -842.522859 hartree
zpe.sumelectthermalfe: -842.575977 hartree
dipole: 5.3784 3.4295 -0.0031
dipole: 6.3788
quadrupole: -93.7676 -68.5803 -87.0942
quadrupole: 7.0292 0.0076 0.0027
quadrupole: -10.6202 14.5670 -3.9468 7.0292 0.0076 0.0027
hfenergy: -842.6754956 hartree
pointgroup: C01 [X(C7H6F3N5)]
dipole: 2.1407356 -1.3097197 0.0001012 debye
dipolederiv: -0.5376999 0.2493978 0.0018406 0.2049726 -0.6888734 -0.0037214 0.0009559 -0.0034038 -0.2737068 -0.6467504 -0.0797007 -0.205416 -0.1162582 -0.362526 -0.1888144 -0.19066 -0.1706802 -0.6361388 -0.6451381 -0.0827513 0.2045183 -0.1190356 -0.3674457 0.1924506 0.1877099 0.1739059 -0.6297736 -0.2821825 0.1780943 -0.000006 -0.1821996 -0.3812505 0.0001896 0.0001117 -0.0001431 -0.2364252 -0.6192386 -0.13859 0.0003641 -0.0839351 -0.7069419 0.00003 0.0004349 0.0003839 -0.1632384 -0.6953592 0.7889498 0.0002157 0.0725763 -0.9097908 0.0002001 0.0002721 -0.0009174 -0.179471 -0.3069329 0.5192752 -0.0001716 0.103112 -1.433096 0.0000957 -0.0000307 -0.0005945 -0.4602656 -0.2399069 -0.5130719 0.0000741 -0.1789642 -0.0760391 0.0001469 0.0000491 0.0004599 -0.2023084 -0.1747228 -0.1064274 0.0001473 0.0174123 -0.7378339 0.0001275 0.0001285 0.0002039 0.0095411 0.447853 0.0970813 -0.0002975 0.319172 0.5416215 -0.0003175 -0.0005175 -0.0001108 0.1086519 0.5685151 -0.8030634 -0.0001683 -0.2482442 1.7526047 -0.000063 -0.0005011 0.0006226 0.2269341 0.2734961 -0.1760709 -0.0000908 0.1001843 0.9562994 -0.0002786 0.0018751 0.0000417 -0.0856349 0.2589548 0.0560506 -0.0003452 -0.0353952 -0.0219947 -0.0000156 -0.0003208 -0.0000653 -0.102725 1.9667249 -0.0585513 -0.0010479 -0.0508996 1.3899254 0.0001526 0.0001592 0.0001512 1.5178937 0.2434024 0.1925176 -0.0001492 0.091816 0.5384019 -0.0001697 -0.0001215 -0.0001057 0.2071423 0.0160133 0.040317 0.0001365 0.0621153 0.0503799 -0.0000279 0.0001372 -0.0000081 0.1748786 0.1839136 0.023119 0.000166 0.029001 0.3280602 -0.0000113 0.0001561 -0.0000213 0.3530225 0.124774 -0.1375074 0.0001826 -0.0639013 0.1451947 0.0000694 0.0001451 0.0002136 0.3292454 0.0345622 -0.1037048 -0.0858657 0.008336 0.0394539 0.0313359 -0.0881504 -0.037093 -0.0426656 0.0349448 -0.1036963 0.0857476 0.0082389 0.0393427 -0.0313061 0.087991 0.0373509 -0.0430939 -0.0052229 0.158333 0.0001653 0.0618965 -0.0954923 -0.0000729 0.0001761 -0.0001902 0.1281375 unknown
polarizability: 137.6975877|7.8340084|143.4066773|-0.0625779|-0.0216763|56.4313663 unknown
InChI: InChI=1S/C7H6F3N5/c1-11-4-3-2-12-15-5(3)14-6(13-4)7(8,9)10/h2,11,15H,1H3
charge 0 multiplicity 1
21 atoms
F  -3.018833 1.623626 0.011588
F  -3.074172 -0.325507 -1.137653
F  -3.075431 -0.342834 1.130525
N  2.009492 2.185869 -0.001648
N  -0.330677 1.416197 0.000689
N  -0.508234 -1.032747 0.001309
N  1.338063 -2.479821 -0.000298
N  3.290766 1.637313 -0.002772
C  1.701696 -0.039028 -0.000933
C  1.022035 1.221458 -0.000497
C  0.852629 -1.201409 0.000037
C  -1.000749 0.23975 0.001526
C  3.098784 0.287811 -0.002297
C  -2.524336 0.310246 0.001834
C  0.461711 -3.662058 0.000686
H  3.97245 -0.361835 -0.002971
H  1.894142 3.19763 -0.001749
H  2.348685 -2.610886 -0.001055
H  -0.191983 -3.666677 -0.888371
H  -0.189893 -3.666816 0.891285
H  1.089458 -4.567579 -0.000135
