program: Gaussian 09
title: 000249356
version: EM64L-G09RevD.01
frameworkgroup: C1[X(C8H9BrN4)]
method: RPBEPBE
basis: SDD
operation: Freq
keyword: #p
keyword: freq=noraman
keyword: PBEPBE/SDD
title: #p freq=noraman PBEPBE/SDD
converged: YES YES NO NO
title: Mulliken charges:
elementType: Br N N N N C C C C C C C C H H H H H H H H H
charge: -0.013338 -0.135317 -0.152155 -0.622791 -0.621470 0.499591 -0.361011 -0.358254 -0.194959 -0.229532 -0.234651 -0.369269 0.266571 0.253398 0.247946 0.227507 0.233653 0.247575 0.312410 0.340246 0.357348 0.306502
chargesum: 0.00000
title: Mulliken charges with hydrogens summed into heavy atoms:
elementType: Br N N N N C C C C C C C C
charge: -0.013338 -0.135317 -0.152155 0.029865 0.042380 0.499591 -0.361011 -0.104855 0.052987 -0.002026 -0.000998 -0.121694 0.266571
polarizability: 2.73392159e+02 2.22701722e+01 1.63185669e+02 5.80957902e-02 7.82237837e-01 5.03406182e+01
1716.lowfreq: -6.2734 -0.0003 0.0004 0.0005 2.3717 5.2045 25.3938 64.7311 66.9329
frequency: 25.3629 64.7257 66.9306 119.3570 141.8876 151.4124 177.0925 225.8864 267.1129 293.6649 332.1448 348.1750 406.3047 448.2872 452.8123 453.4777 519.7020 537.6800 603.1747 634.9459 645.7391 672.4360 715.1018 726.0929 761.2595 839.4154 871.3615 938.4772 949.4564 959.5399 989.1377 997.0353 1007.1065 1037.8022 1049.5934 1105.9948 1133.1408 1168.4164 1224.3388 1276.0224 1332.5493 1371.7083 1419.1212 1453.0259 1491.9931 1507.9994 1554.6758 1577.9505 1585.0668 1599.5865 1626.3364 3080.9194 3132.7306 3149.1347 3162.0318 3174.1814 3489.3516 3557.1633 3680.3040 3709.9881
redmass: 4.4834 6.0542 4.9222 2.8465 4.1072 1.7550 5.0832 5.2033 2.4689 8.6027 4.9422 3.8315 1.2934 4.2008 3.3144 2.9587 1.2124 3.1895 5.2006 2.9777 3.4564 6.0784 1.8443 3.1973 1.2829 4.5599 1.3641 4.4001 1.3955 1.4635 1.3469 6.7869 1.7917 2.0313 2.0235 1.9373 2.5846 1.0609 1.6343 1.6353 2.0907 3.8285 2.5105 2.7455 2.4517 2.8425 5.1838 3.2111 2.1041 4.7255 1.5785 1.0881 1.0855 1.0898 1.0949 1.0996 1.0484 1.0452 1.0996 1.1045
irintensity: 2.9868 2.9133 4.8563 17.8345 7.4108 47.0327 6.3685 3.5123 8.3111 5.1561 6.1255 38.8811 359.1548 23.4705 19.1207 0.7382 85.2191 0.5489 11.3235 14.9655 37.9797 13.2716 98.5723 32.3162 85.7729 2.9636 0.6305 69.1176 6.9297 25.5152 1.9619 66.0338 11.5473 10.9527 0.3027 29.6232 117.0202 0.8350 14.4089 5.4210 22.4797 22.9512 66.0591 9.4367 525.7795 350.3585 32.6738 23.5948 430.1961 37.9052 609.0375 14.1258 2.1736 5.9274 16.0934 22.5346 26.2295 120.1754 78.3869 40.8738
temp: 298.150 k
press: 1.00000 atm
elementType: 35 7 7 7 7 6 6 6 6 6 6 6 6 1 1 1 1 1 1 1 1 1
symmnumber: 1
zpe: 430616.3 jmol-1
zpe.correction: 0.164013 hartree
zpe.thermalcorrener: 0.177034 hartree
zpe.thermalcorrenthalpy: 0.177979 hartree
zpe.thermalcorrgfe: 0.122491 hartree
zpe.sumelectzpe: -541.755186 hartree
zpe.sumelectthermal: -541.742165 hartree
zpe.sumelectthermalent: -541.741221 hartree
zpe.sumelectthermalfe: -541.796709 hartree
dipole: -5.2036 2.5227 0.0965
dipole: 5.7837
quadrupole: -41.2291 -75.0799 -92.0890
quadrupole: 1.8023 -0.7854 -0.2916
quadrupole: 28.2369 -5.6139 -22.6230 1.8023 -0.7854 -0.2916
hfenergy: -541.9191994 hartree
pointgroup: C01 [X(C8H9Br1N4)]
dipole: -1.7438551 -1.4615014 0.0274161 debye
dipolederiv: -0.0513939 0.0019604 0.0000202 -0.1223482 -0.720058 0.0266042 0.0042765 0.0245964 -0.0524824 1.3012507 0.0547211 -0.0192595 -0.4502816 -0.3430578 0.0072058 -0.0304111 0.00057 -0.1468457 -2.5601947 -0.2257839 0.0277236 -0.2313355 -0.3960039 -0.001258 -0.0114607 0.0099429 -0.2743323 -1.9566795 0.2660467 0.117103 0.4563464 -0.3698071 0.0426422 0.3146057 0.0362272 -0.719667 -0.5039584 -0.0456875 -0.0644236 -0.7285242 -1.131767 -0.0626049 -0.1432923 -0.1203361 -0.6496305 0.6879954 0.0128622 -0.008121 -0.3519724 -0.4260259 0.0212914 0.0048634 0.015549 0.0676311 -0.2296942 -0.0432282 0.0017075 0.2562399 1.2651213 -0.055933 -0.008482 -0.0512227 -0.1493853 -0.1987365 -0.0665524 -0.0000237 0.265978 0.0078554 -0.0102214 -0.0093338 -0.0034612 -0.1396906 0.108135 0.0540369 -0.0049658 0.0910443 -0.3405324 0.00795 -0.0080944 0.0084093 -0.0915716 0.0149918 -0.0043348 -0.002314 -0.0904483 0.1139822 -0.0088673 0.0020786 -0.0099903 -0.15388 -0.1259215 0.0374616 -0.0036474 0.0269509 0.0236459 -0.0070561 -0.0017777 -0.0080519 -0.1704732 -0.5555893 0.0163988 0.0040928 -0.4823251 0.2557393 0.0004863 0.022065 -0.0089407 -0.0997104 3.0593816 -0.0147001 -0.0731526 1.3080394 1.3741613 0.0346639 -0.0790702 0.018235 0.2401612 0.0250335 -0.09294 0.0068791 -0.0787729 0.007975 0.0066804 0.0051219 0.0054206 0.1468771 -0.0258603 -0.0715834 0.00576 -0.0973192 0.0423581 0.0060332 0.007069 0.005727 0.1607638 0.0740303 0.0152228 0.0007998 0.0593032 -0.1308484 0.0100822 -0.0005933 0.0107311 0.1589642 -0.0922083 0.0794342 0.0016715 0.0755182 0.0272072 0.0039055 0.0016538 0.0035316 0.167531 0.0500747 0.0121869 0.0014894 0.0600873 -0.0612956 0.0040215 0.001398 0.0055294 0.1787328 0.2609314 -0.0257689 -0.0221779 0.0236025 0.1518581 -0.0393863 -0.1528059 -0.0360629 0.3914606 0.2591143 -0.0495419 -0.0151184 -0.1238634 0.1959815 -0.0042028 -0.0423768 0.0080945 0.3897425 0.2845623 0.093438 0.0087714 0.1273276 0.2532364 0.0118924 0.0311445 0.0326739 0.3423117 0.1747355 -0.0036485 0.0371854 0.0067531 0.2002744 0.0060707 0.0934218 0.0528278 0.4034928 unknown
polarizability: 277.3320891|6.347827|159.1470258|-3.2513675|-2.5925556|50.4393319 unknown
InChI: InChI=1S/C8H9BrN4/c9-7-4-2-1-3-6(7)5-12-13-8(10)11/h1-5H,10-11H2
charge 0 multiplicity 1
22 atoms
Br 2.153196 2.858702 -0.138587
N  -1.391163 -0.053833 0.016939
N  -2.595248 0.678945 0.018613
N  -4.909095 0.435723 0.096079
N  -3.564289 -1.522924 -0.020933
C  1.034215 0.10411 -0.016656
C  2.226147 0.883713 -0.066462
C  1.207748 -1.31534 0.032914
C  3.511175 0.304623 -0.068351
C  2.480106 -1.91002 0.031257
C  3.641829 -1.100881 -0.019458
C  -0.305959 0.699401 -0.013017
C  -3.661005 -0.151268 0.030532
H  0.299349 -1.92448 0.073984
H  4.398333 0.943214 -0.107586
H  2.573262 -3.000858 0.070094
H  4.639643 -1.551972 -0.020833
H  -0.397782 1.795445 -0.036462
H  -5.765266 -0.080222 -0.081966
H  -4.928786 1.452384 0.134058
H  -2.600475 -1.865623 -0.046085
H  -4.347035 -2.150237 0.133527
