program: Gaussian 09
title: 000249325
version: EM64L-G09RevD.01
frameworkgroup: C1[X(C8H12N2O4S2)]
method: RPBEPBE
basis: SDD
operation: Freq
keyword: #p
keyword: freq=noraman
keyword: PBEPBE/SDD
title: #p freq=noraman PBEPBE/SDD
converged: YES YES NO NO
title: Mulliken charges:
elementType: S S O O O O N N C C C C C C C C H H H H H H H H H H H H
charge: 0.913687 0.955328 -0.528634 -0.527384 -0.530565 -0.531105 -0.464883 -0.719227 -0.008080 -0.026260 -0.209155 -0.235440 -0.215365 -0.213810 -0.373342 -0.652373 0.289146 0.300245 0.306571 0.294581 0.295619 0.246132 0.267174 0.251095 0.209091 0.225802 0.339455 0.341695
chargesum: 0.00000
title: Mulliken charges with hydrogens summed into heavy atoms:
elementType: S S O O O O N N C C C C C C C C
charge: 0.913687 0.955328 -0.528634 -0.527384 -0.530565 -0.531105 -0.158312 -0.038077 -0.008080 -0.026260 0.079991 0.064806 0.079217 0.081809 0.139965 0.033615
polarizability: 2.33626895e+02 -3.08393696e+00 1.52076772e+02 -1.58670428e+00 1.09935866e+01 1.21587560e+02
1716.lowfreq: -6.1927 -3.4849 0.0014 0.0015 0.0023 4.4242 22.6819 25.4465 38.7553
frequency: 22.5440 25.1173 38.7467 43.8592 76.8420 98.8256 110.5006 117.6045 152.5015 165.6567 184.2291 198.1786 227.0443 259.3177 264.9358 280.7411 295.8713 308.3018 337.1350 354.2756 383.4455 395.6249 410.2936 435.3466 444.3069 469.8994 508.0170 536.3391 606.7504 686.7127 723.8749 750.7854 794.0641 798.5149 808.1563 828.8043 852.0111 863.0568 881.9656 911.2247 939.1705 975.8660 979.4712 992.7054 1045.0238 1047.3530 1048.3833 1071.7006 1084.3840 1102.4746 1111.3823 1172.0087 1254.8941 1279.2959 1300.1185 1373.9034 1375.9629 1397.7836 1402.6507 1440.0491 1446.6075 1469.2116 1475.9168 1534.3329 1564.9561 1607.5325 2981.9758 2996.8637 3056.6419 3081.5500 3091.5776 3155.0885 3158.3942 3170.4744 3175.0346 3335.3594 3370.6280 3537.9606
redmass: 4.1124 4.7151 4.6909 3.6007 3.6574 9.0284 3.9220 1.5249 6.6435 6.5920 2.7559 4.2612 2.8021 2.8874 2.6362 4.3803 9.4153 6.5814 3.9956 5.9234 4.1076 6.4679 2.8624 4.9331 9.8309 3.5280 5.1456 3.5600 7.0744 6.1932 3.7793 1.2232 1.9031 11.4207 6.4388 1.8823 1.2865 1.4082 1.9103 3.9439 5.8270 2.2013 2.4675 1.3822 3.1060 1.9255 5.7215 1.4799 1.8227 1.5203 1.4112 1.1342 1.1852 1.2324 1.2173 1.2200 3.3352 1.2160 6.8574 1.0691 2.0687 1.0464 1.0442 1.0859 5.9473 8.2354 1.0362 1.0637 1.0985 1.0991 1.1012 1.0888 1.0888 1.0971 1.0979 1.0741 1.0415 1.1005
irintensity: 0.1823 0.5748 0.0873 0.5036 0.9646 6.4265 5.1832 34.5692 2.4434 1.8056 5.8077 0.5426 4.2447 14.7451 6.6762 10.6341 42.3123 1.6992 5.4179 2.8976 2.8023 1.5757 0.0547 51.6552 64.8990 91.7684 124.2110 143.0263 0.0410 15.2604 0.4652 71.2423 134.6671 65.4706 154.7204 60.1444 9.6374 32.4609 20.7441 58.7424 51.4176 0.2003 3.5138 0.3620 27.5033 29.7990 0.1071 28.4166 4.0104 18.4698 3.3990 0.9696 6.0507 0.0372 15.7431 6.8191 35.7693 20.2291 3.5103 19.8896 16.4417 11.2448 15.2026 24.9149 0.9459 0.0255 21.1460 12.8930 1.2561 32.0621 23.1535 8.1616 3.7179 3.0602 0.4962 11.3898 34.1832 28.6817
temp: 298.150 k
press: 1.00000 atm
elementType: 16 16 8 8 8 8 7 7 6 6 6 6 6 6 6 6 1 1 1 1 1 1 1 1 1 1 1 1
symmnumber: 1
zpe: 521907.4 jmol-1
zpe.correction: 0.198784 hartree
zpe.thermalcorrener: 0.217557 hartree
zpe.thermalcorrenthalpy: 0.218501 hartree
zpe.thermalcorrgfe: 0.149608 hartree
zpe.sumelectzpe: -1516.981430 hartree
zpe.sumelectthermal: -1516.962657 hartree
zpe.sumelectthermalent: -1516.961713 hartree
zpe.sumelectthermalfe: -1517.030607 hartree
dipole: 1.3439 -2.8376 5.6268
dipole: 6.4436
quadrupole: -113.9161 -112.0819 -112.7441
quadrupole: -1.9739 -3.3385 1.8304
quadrupole: -1.0020 0.8321 0.1699 -1.9739 -3.3385 1.8304
hfenergy: -1517.1802143 hartree
pointgroup: C01 [X(C8H12N2O4S2)]
dipole: 0.2332152 -2.0910203 1.4141903 debye
polarizability: 231.4787892|-14.77104|137.9796665|1.4191793|18.6961682|137.832771 unknown
InChI: InChI=1S/C8H12N2O4S2/c1-2-10-16(13,14)8-5-3-7(4-6-8)15(9,11)12/h3-6,10H,2,9H2,1H3
charge 0 multiplicity 1
28 atoms
S  2.425126 0.12562 -0.086031
S  -4.075491 0.265201 -0.099841
O  2.910824 -0.080039 -1.627566
O  2.912083 1.38469 0.832526
O  -4.525421 1.614842 0.690697
O  -4.561707 -0.113794 -1.605945
N  2.780034 -1.509264 0.798687
N  -4.531438 -1.159063 0.966112
C  0.534192 0.139941 -0.078313
C  -2.186938 0.205097 -0.082753
C  -0.136612 -0.587412 -1.074943
C  -0.103958 0.920993 0.897928
C  -1.548961 -0.553987 -1.077511
C  -1.517402 0.955537 0.895953
C  3.934963 -2.237001 0.19142
C  5.328772 -1.663218 0.510757
H  0.423141 -1.141056 -1.834659
H  0.485777 1.502353 1.613833
H  2.976129 -1.211539 1.777045
H  -2.134206 -1.077727 -1.839631
H  -2.077881 1.565164 1.611415
H  3.834136 -3.27746 0.557831
H  3.765488 -2.258388 -0.900163
H  5.438513 -0.645005 0.097186
H  5.508423 -1.617839 1.601258
H  6.11569 -2.29711 0.063223
H  -5.018613 -0.798635 1.803111
H  -5.104161 -1.811803 0.405873
