program: Gaussian 09
title: 000249314
version: EM64L-G09RevD.01
frameworkgroup: C1[X(C7H11NO6)]
method: RPBEPBE
basis: SDD
operation: Freq
keyword: #p
keyword: freq=noraman
keyword: PBEPBE/SDD
title: #p freq=noraman PBEPBE/SDD
converged: YES YES NO NO
title: Mulliken charges:
elementType: O O O O O O N C C C C C C C H H H H H H H H H H H
charge: -0.303177 -0.395749 -0.414592 -0.229969 -0.218947 -0.280818 -0.384729 -0.134379 -0.530196 0.167600 0.213586 0.326698 -0.256385 -0.662123 0.318374 0.293006 0.252912 0.320038 0.219734 0.238236 0.214553 0.252318 0.223478 0.388064 0.382469
chargesum: 0.00000
title: Mulliken charges with hydrogens summed into heavy atoms:
elementType: O O O O O O N C C C C C C C
charge: -0.303177 -0.007685 -0.032123 -0.229969 -0.218947 -0.280818 -0.064691 0.183995 0.015722 0.167600 0.213586 0.326698 0.201585 0.028225
polarizability: 1.23087383e+02 2.81191009e+00 1.00690392e+02 -2.97746922e+00 -2.54726912e-01 8.29870256e+01
1716.lowfreq: -3.9413 0.0010 0.0011 0.0011 1.1123 5.2464 29.0617 32.8018 35.2841
frequency: 29.0265 32.7968 35.2628 45.1372 64.4361 74.8189 95.7293 114.7333 153.0531 218.8403 229.8212 296.7476 299.7553 322.8758 354.0672 409.4816 433.6730 501.1081 533.1501 561.4425 567.8925 601.8276 630.9640 656.6811 662.7917 687.8939 705.8104 801.7079 824.3226 838.3830 883.1070 923.0985 967.7945 1030.0326 1040.2056 1070.9880 1092.6377 1096.9842 1156.3446 1162.1032 1185.4770 1216.8131 1257.8298 1269.7914 1282.2532 1314.7964 1334.0780 1359.7619 1367.1537 1390.4901 1441.9229 1457.8799 1462.4009 1483.6604 1490.5442 1647.0113 1664.5226 1675.8141 2991.9326 2994.5646 3011.3980 3029.5112 3078.0607 3086.7772 3092.3310 3118.5236 3513.2987 3514.1893 3567.2258
redmass: 5.0637 7.6696 9.0673 4.1570 4.8190 5.3176 5.5254 4.6316 3.2106 1.3181 5.5602 2.8646 5.8756 3.8432 3.6161 4.6492 3.8019 2.1384 2.4581 1.9922 3.0502 1.9546 1.9528 3.6631 1.5718 2.8309 10.9349 1.2732 3.9079 4.6373 2.2395 4.5078 2.9870 3.3795 3.6214 2.2639 2.3120 2.1640 1.6604 2.3505 1.8734 1.7189 1.4158 1.6571 1.1108 2.0453 1.3939 1.2604 1.9459 1.2364 1.1068 1.0867 1.0493 1.1016 1.6879 9.6396 8.7030 8.8864 1.0362 1.0811 1.0619 1.0597 1.0992 1.0974 1.1032 1.1058 1.0640 1.0640 1.0774
irintensity: 0.2712 1.9421 1.2575 0.9691 1.8597 5.9606 0.2151 2.1255 5.2395 5.7575 0.1016 9.3576 7.4050 8.7336 1.9796 1.5067 12.0639 11.8848 24.5061 194.8996 28.5490 96.4132 90.0108 10.3634 106.7121 41.6317 35.7725 6.4927 33.2481 5.8234 2.8301 14.4168 32.6924 190.2788 109.6346 325.0136 62.6072 21.0855 34.0898 20.4281 111.7863 187.5732 21.1257 35.1242 4.8111 61.2452 26.8517 0.1739 64.1715 27.5429 69.7954 14.5739 9.8956 17.5475 289.0726 230.1160 78.6709 364.0411 20.0578 21.1359 9.9065 32.6406 5.9550 37.8892 1.3470 34.7595 31.0150 32.7847 32.1904
temp: 298.150 k
press: 1.00000 atm
elementType: 8 8 8 8 8 8 7 6 6 6 6 6 6 6 1 1 1 1 1 1 1 1 1 1 1
symmnumber: 1
zpe: 493504.7 jmol-1
zpe.correction: 0.187966 hartree
zpe.thermalcorrener: 0.203434 hartree
zpe.thermalcorrenthalpy: 0.204378 hartree
zpe.thermalcorrgfe: 0.142045 hartree
zpe.sumelectzpe: -778.374229 hartree
zpe.sumelectthermal: -778.358761 hartree
zpe.sumelectthermalent: -778.357817 hartree
zpe.sumelectthermalfe: -778.420150 hartree
dipole: -0.7719 0.0451 -3.5538
dipole: 3.6369
quadrupole: -72.3965 -73.3598 -87.7382
quadrupole: -6.5430 -0.8868 0.3302
quadrupole: 5.4350 4.4717 -9.9067 -6.5430 -0.8868 0.3302
hfenergy: -778.5621947 hartree
pointgroup: C01 [X(C7H11N1O6)]
dipole: -0.2447883 -0.4204486 -1.3456255 debye
dipolederiv: -1.6256009 -0.2835464 -0.1146834 -0.5490369 -0.5435449 -0.12864 -0.3244477 -0.1860015 -0.4877763 -0.869652 0.292326 -0.3166321 0.3337863 -0.4405391 0.1747067 -0.3429382 0.1818048 -0.5784824 -0.7394297 0.3705481 0.1613407 0.4948894 -0.9004566 -0.3132835 0.1416079 -0.2615311 -0.3878842 -0.9038008 -0.0908873 -0.1615199 -0.4237768 -0.7726523 0.047226 -0.0483064 0.1231181 -0.391153 -0.5115487 0.1747223 0.1365153 0.1285497 -0.5746226 0.1757988 0.2408956 -0.0416019 -0.8285995 -0.7599402 -0.0603146 0.1070875 -0.0611986 -0.4603576 -0.2388313 0.1187829 -0.2110499 -0.845615 -1.4786062 -0.0987763 0.2381855 -0.0145231 -0.5640588 0.0621463 0.2903009 0.0847937 -0.3592845 0.6290059 0.1205753 0.019728 0.2305764 0.2206592 0.0287661 0.2880504 0.2237753 0.0120012 -0.0431226 -0.1227517 0.0815053 0.0424309 -0.2723979 0.2085557 -0.0142004 0.1941694 -0.0044163 1.2813892 -0.0062268 0.4539908 0.1352856 1.0599515 -0.3311511 0.3716881 -0.421194 0.5294895 0.7492031 -0.5028921 -0.3893519 -0.6710203 1.2627809 -0.0861083 -0.3786229 0.018763 1.0589984 2.2926769 0.3975879 -0.2457979 0.5702906 0.6234929 0.3741652 -0.1549466 0.3661743 1.1737104 0.9956815 0.069192 0.0090398 0.0065973 0.350513 0.0046568 -0.1908177 -0.0713707 0.2393575 -0.1309815 0.0532627 -0.0243337 0.0996581 -0.1169978 0.0108567 0.021085 0.0516408 0.0537527 0.1676476 -0.0041315 0.0283912 -0.0646138 0.0940602 -0.0068417 -0.0356507 -0.0981187 0.0911754 0.0077307 -0.0209042 -0.0296182 -0.0707629 0.1324907 -0.0272698 -0.0395263 -0.0082693 0.0950533 0.0958932 0.0416623 -0.0358146 0.0426066 0.0674479 -0.0441204 0.0039814 -0.0359096 -0.0639297 0.1775622 -0.0643787 0.046077 -0.0915528 0.3150136 -0.0261037 0.0171434 -0.066761 0.172862 -0.0382596 -0.0534639 -0.0140694 -0.0669552 -0.1014736 -0.0573583 -0.0292765 -0.0947606 0.0704617 0.0026303 0.0211216 -0.0468142 0.0480158 0.0745682 0.0195143 0.0580288 0.0854 -0.0854213 -0.174079 -0.0230706 0.0747607 -0.0075776 0.1005918 0.0287782 0.0863156 0.0210652 0.0792317 0.0989946 -0.0833653 -0.0457467 -0.0537824 -0.0532037 -0.0484642 -0.0477192 -0.069608 0.0593881 0.1148327 0.0168573 0.0080348 0.0268899 0.068386 0.0204619 -0.0424496 0.049068 -0.1424 0.275647 -0.1306714 0.0153739 -0.0945196 0.1591641 0.0447185 -0.012653 0.0306852 0.3699452 0.3861263 -0.0124747 0.0443515 0.0097432 0.2711852 0.1078211 0.0236751 0.1357183 0.169535 unknown
polarizability: 123.5722106|0.4339551|98.5192147|-1.5862963|-5.4066038|84.6733756 unknown
InChI: InChI=1S/C7H11NO6/c1-2-14-7(13)8-4(6(11)12)3-5(9)10/h4,8-9,11H,2-3H2,1H3
charge 0 multiplicity 1
25 atoms
O  -2.360018 -1.028863 -0.646858
O  -0.068915 2.303816 -1.303367
O  3.162358 -2.527402 0.053475
O  2.102082 2.572542 -0.528812
O  1.891634 -1.618555 1.773629
O  -1.615784 0.201811 1.228391
N  -0.213354 -0.299641 -0.589746
C  0.935534 0.436328 -0.084531
C  2.261145 -0.327846 -0.302895
C  1.079814 1.862597 -0.652486
C  2.379963 -1.518477 0.629368
C  -1.411391 -0.316912 0.102756
C  -3.720827 -1.112497 -0.041817
C  -4.549804 0.129165 -0.381449
H  0.773695 0.558276 1.006436
H  3.102804 0.359625 -0.092671
H  2.375672 -0.664075 -1.347911
H  -0.21249 -0.667634 -1.541805
H  -4.144051 -2.028123 -0.485424
H  -3.612074 -1.234854 1.050154
H  -5.579114 0.008742 0.005189
H  -4.110379 1.02789 0.082813
H  -4.605719 0.279409 -1.47359
H  0.060792 3.247689 -1.593799
H  3.262027 -3.277313 0.701451
