program: Gaussian 09
title: 000249308
version: EM64L-G09RevD.01
frameworkgroup: C1[X(C6H8N2OS)]
method: RPBEPBE
basis: SDD
operation: Freq
keyword: #p
keyword: freq=noraman
keyword: PBEPBE/SDD
title: #p freq=noraman PBEPBE/SDD
converged: NO NO NO NO
title: Mulliken charges:
elementType: S O N N C C C C C C H H H H H H H H
charge: 0.226539 -0.251264 -0.342865 0.009349 -0.558899 -0.176687 -0.660921 0.161924 -0.257507 -0.256806 0.285130 0.285262 0.343027 0.231794 0.231763 0.231151 0.252120 0.246891
chargesum: 0.00000
title: Mulliken charges with hydrogens summed into heavy atoms:
elementType: S O N N C C C C C C
charge: 0.226539 -0.251264 0.000162 0.009349 0.011492 -0.176687 0.033787 0.161924 -0.005387 -0.009916
polarizability: 1.60281005e+02 -2.09535747e+00 9.93154017e+01 -1.46413220e-04 1.52259426e-03 4.78204902e+01
1716.lowfreq: -12.7388 0.0012 0.0018 0.0018 4.6030 9.7610 34.2442 50.4129 112.3369
frequency: 34.2308 50.0339 112.3344 141.8327 182.5836 235.5299 254.9949 284.2224 397.1070 436.4736 467.7752 520.1381 612.0650 621.9903 687.4532 715.8247 758.4794 774.7931 827.4697 854.6940 934.1982 966.5553 992.0111 1040.6439 1046.8569 1068.1876 1128.5642 1190.4456 1229.6440 1266.7595 1275.9430 1378.4448 1399.1341 1405.9683 1448.0845 1471.3707 1482.3881 1495.7678 1534.1571 1660.2401 2990.3718 3056.5602 3086.5753 3089.0898 3137.5057 3150.9204 3197.5117 3484.6030
redmass: 2.9167 2.6602 4.1638 6.2666 6.9043 1.0952 7.6399 3.7942 2.8952 9.6110 6.1605 9.9999 4.2291 4.7417 8.2011 2.3299 1.7345 1.1227 1.6107 5.5882 7.9094 1.3651 1.8578 2.5029 1.2151 2.1547 2.5810 2.5572 1.2283 1.8330 1.2586 1.7269 1.2088 2.4552 1.0845 1.0390 1.0542 4.6895 5.3999 7.0207 1.0355 1.0600 1.0969 1.1014 1.1085 1.0907 1.0969 1.0778
irintensity: 0.0000 1.1684 0.5797 2.8094 10.9210 0.1258 0.8703 1.3755 14.8284 18.7514 6.6120 0.4430 19.2704 7.8323 13.6205 17.1544 42.0623 21.7109 58.9925 0.4274 26.7177 0.1520 34.7948 30.6459 0.1103 0.1892 43.5733 53.0426 0.7653 79.5920 39.4581 6.3337 17.7155 9.0607 15.1920 16.5013 13.9346 538.7225 2.1179 557.7428 27.2090 2.7793 21.0181 15.9419 17.0472 21.1665 3.8776 34.0181
temp: 298.150 k
press: 1.00000 atm
elementType: 16 8 7 7 6 6 6 6 6 6 1 1 1 1 1 1 1 1
symmnumber: 1
zpe: 356358.7 jmol-1
zpe.correction: 0.135730 hartree
zpe.thermalcorrener: 0.145883 hartree
zpe.thermalcorrenthalpy: 0.146828 hartree
zpe.thermalcorrgfe: 0.098665 hartree
zpe.sumelectzpe: -815.483137 hartree
zpe.sumelectthermal: -815.472983 hartree
zpe.sumelectthermalent: -815.472039 hartree
zpe.sumelectthermalfe: -815.520201 hartree
dipole: -4.1499 1.6758 0.0034
dipole: 4.4755
quadrupole: -71.8181 -63.9562 -67.8978
quadrupole: 7.4315 -0.0054 -0.0018
quadrupole: -3.9274 3.9345 -0.0071 7.4315 -0.0054 -0.0018
hfenergy: -815.6188664 hartree
pointgroup: C01 [X(C6H8N2O1S1)]
dipole: -1.6463555 -0.6069525 -0.1468179 debye
dipolederiv: -0.8649936 0.0744587 -0.0264053 0.2369664 -0.1561837 0.0032287 -0.0070221 -0.0041515 -0.092336 -1.1437242 -0.3340548 -0.0736299 -0.6234397 -0.7357568 -0.0700747 -0.1074269 -0.0570318 -0.3877592 -1.3514423 -0.262229 -0.0812608 0.1967496 -0.3343075 -0.0035247 -0.027625 -0.0243015 -0.2342694 -1.0436996 0.1156036 -0.0245694 1.097584 -0.9678048 -0.0400665 0.0904338 -0.0845493 -0.205877 0.4937419 0.1815531 0.0379165 0.3609143 0.1352157 0.0169067 0.0587032 0.008819 0.1363262 1.3914064 -0.0609171 0.0529587 -0.9964405 0.9203014 0.0553439 -0.0565148 0.0976705 0.0687889 -0.1474359 0.0256177 -0.00677 -0.1717258 0.0360708 -0.0119465 -0.0302241 -0.0030204 0.0689221 1.7006429 0.4058063 0.1137376 0.6423838 0.8966679 0.1067236 0.1414479 0.096157 0.2484751 -0.4433508 -0.0841895 -0.0211624 -0.5515924 -0.4599129 -0.0559553 -0.0757756 -0.0349523 -0.2007608 1.0606911 -0.0634891 0.0419887 -0.2541697 0.5089518 0.0521667 0.0196946 0.0608352 -0.0279705 -0.0110777 -0.0030206 0.0348206 -0.0681185 0.0046554 -0.0781557 0.0384794 -0.0608144 -0.0267613 -0.0034023 -0.0004485 -0.0346846 -0.0640788 -0.0278208 0.0724915 -0.0534976 0.0609769 -0.0011493 0.1888541 0.0159992 -0.0044916 0.0415732 0.1765193 -0.015985 -0.0016342 -0.0170665 0.3283081 0.0980684 0.0094777 0.0156897 0.0845206 0.0543861 -0.0931128 0.0711027 -0.0903501 -0.0789716 0.1034714 0.0019747 0.000064 0.0873847 0.0043117 0.1217688 -0.0363659 0.1117668 -0.0343503 -0.0915533 -0.0947329 -0.0210842 -0.1121079 -0.0247503 -0.0229691 -0.0231052 -0.0221702 0.1226844 -0.0160587 0.0712837 -0.0005738 0.0290146 0.0688448 -0.0118424 -0.0055348 -0.0099728 0.1800882 0.0798623 0.0013068 -0.0025438 0.0645822 -0.0993878 -0.024997 0.0048644 -0.0278446 0.1366124 unknown
polarizability: 160.1194357|0.0378416|98.5528551|5.0880342|5.9336067|48.7446064 unknown
InChI: InChI=1S/C6H8N2OS/c1-2-10-6-7-4-3-5(9)8-6/h3-4,8H,2H2,1H3
charge 0 multiplicity 1
18 atoms
S  -1.789664 1.121989 -0.003224
O  3.259003 1.25427 0.239746
N  0.930738 1.00611 0.105698
N  -0.161954 -1.093527 -0.188602
C  -2.993503 -0.33257 -0.229637
C  -0.204184 0.228636 -0.036163
C  -4.428172 0.213271 -0.229486
C  2.275825 0.471685 0.103939
C  2.290998 -0.977031 -0.064473
C  1.103219 -1.678328 -0.199942
H  -2.72305 -0.823868 -1.176152
H  -2.802585 -1.033819 0.596315
H  0.864381 2.024637 0.220579
H  -4.674901 0.715996 0.722246
H  -4.594927 0.926877 -1.055562
H  -5.131929 -0.628669 -0.360987
H  3.261848 -1.476533 -0.079098
H  1.104557 -2.765727 -0.326894
