program: Gaussian 09
title: 000249301
version: EM64L-G09RevD.01
frameworkgroup: C1[X(C17H32O4)]
method: RPBEPBE
basis: SDD
operation: Freq
keyword: #pfreq=noraman
keyword: PBEPBE/SDD
title: #p freq=noraman PBEPBE/SDD
converged: YES YES NO NO
title: Mulliken charges:
elementType: O O O O C C C C C C C C C C C C C C C C C H H H H H H H H H H H H H H H H H H H H H H H H H H H H H H H H
charge: -0.275954 -0.276167 -0.224526 -0.223207 0.132546 -0.423323 -0.424803 -0.394693 -0.393679 0.178461 0.175774 -0.350954 -0.350955 -0.363010 -0.363240 -0.698206 -0.698118 -0.262494 -0.262672 -0.666571 -0.666110 0.224182 0.206825 0.206966 0.224094 0.210960 0.215975 0.218715 0.209168 0.190306 0.184292 0.189819 0.184504 0.199254 0.196722 0.196534 0.199722 0.215976 0.209453 0.209396 0.209428 0.215980 0.209305 0.220487 0.232675 0.220499 0.233056 0.216101 0.260614 0.222599 0.216198 0.259147 0.222951
chargesum: 0.00000
title: Mulliken charges with hydrogens summed into heavy atoms:
elementType: O O O O C C C C C C C C C C C C C C C C C
charge: -0.275954 -0.276167 -0.224526 -0.223207 0.132546 0.007683 0.006257 0.032242 0.034204 0.178461 0.175774 0.023644 0.023368 0.032966 0.033016 -0.063382 -0.063404 0.190668 0.190883 0.032742 0.032187
polarizability: 2.24763010e+02 -1.03114022e+01 1.96276891e+02 1.19399909e-01 2.77125865e-02 1.72753567e+02
1716.lowfreq: -20.8093 -6.3109 -0.0009 -0.0007 0.0008 5.5226 10.5594 15.8431 21.2668
frequency: -16.2683 15.7757 19.0836 27.7876 37.7178 42.4987 48.6088 48.6509 71.4114 92.4262 100.1417 103.2498 105.1152 107.6302 120.1498 138.6515 152.6730 161.3253 185.2634 199.2661 201.1344 224.5615 225.6964 228.2911 246.6163 249.4768 273.4169 296.9032 322.2192 327.3209 349.2704 368.6202 403.0458 430.9918 446.8052 470.1817 539.6093 580.0869 646.1174 704.1882 722.0571 723.7789 736.4373 745.1948 746.0786 753.9185 770.3201 815.8221 816.9813 831.7386 834.8439 840.0136 890.6181 893.1545 906.1836 953.5476 968.1067 976.4038 1011.3244 1014.5686 1018.1422 1034.2544 1047.5723 1072.5265 1073.6350 1074.4316 1084.2380 1087.4840 1096.7897 1097.9393 1104.7607 1115.6756 1128.9492 1145.5045 1155.1830 1156.3274 1190.3227 1201.9264 1235.3177 1240.2711 1251.5873 1261.5028 1278.1696 1279.9965 1284.0669 1287.2878 1289.8482 1294.8135 1296.3659 1311.3906 1331.0318 1342.7699 1349.5519 1353.9534 1355.3794 1357.4216 1366.4046 1385.5953 1387.0712 1389.9688 1392.0020 1447.3286 1454.9284 1455.3499 1460.8900 1461.4263 1462.2364 1463.4577 1463.7778 1467.4217 1469.1730 1475.6774 1475.9343 1477.2380 1478.3030 1484.7765 1485.5869 1486.2219 1486.9892 1615.5816 1646.8830 2949.9650 2950.3591 2967.9180 2968.2002 2970.9440 2971.2057 2980.5380 2983.2379 2989.7732 2991.4982 2991.9394 2992.5059 2992.7559 2992.8561 3020.8574 3021.1276 3026.8834 3027.3665 3037.4145 3039.6366 3061.0597 3063.9563 3068.1802 3068.7917 3070.7305 3070.8314 3086.3556 3086.4029 3093.4051 3093.4604 3118.4543 3118.5391
redmass: 1.9748 4.3207 2.4023 3.6247 2.6479 2.1093 2.8853 3.0336 2.9507 3.5327 3.1455 2.6381 5.3573 2.5511 1.9097 2.2406 4.0575 3.6230 2.1611 1.5243 4.0161 1.1310 1.1350 1.5481 2.2159 1.8679 4.9671 2.7403 2.9247 3.0958 5.0411 3.3369 3.5317 3.3169 3.3135 3.2945 5.3476 4.6808 2.5119 3.0953 1.1401 1.1141 5.6502 1.4162 1.4517 2.4029 1.7458 1.5131 1.4635 1.2826 1.5065 3.0954 1.8496 1.8881 1.7817 1.2200 4.3648 1.4691 2.8835 4.3793 2.8410 3.8306 2.8223 2.3625 2.7339 2.4182 2.8484 2.6468 2.1521 2.1546 1.4210 2.6856 3.2641 5.2215 1.6612 1.7250 1.9416 1.5057 1.5519 1.3552 1.3412 1.2318 1.1165 1.1149 1.2059 1.0626 1.0871 1.2749 1.1508 1.3472 1.3585 1.4143 1.4998 1.4215 1.4013 1.3655 1.4791 1.2185 1.2180 1.2312 1.2316 1.0766 1.0924 1.0945 1.0717 1.0767 1.0655 1.0482 1.0533 1.0746 1.0737 1.0430 1.0433 1.0732 1.0735 1.0513 1.0522 1.0835 1.0853 10.1544 10.4642 1.0587 1.0587 1.0580 1.0581 1.0372 1.0373 1.0607 1.0606 1.0608 1.0702 1.0957 1.0883 1.0365 1.0362 1.1018 1.1018 1.0594 1.0594 1.0997 1.1004 1.1038 1.1025 1.1011 1.1014 1.0992 1.0992 1.0980 1.0981 1.1030 1.1029 1.1053 1.1053
irintensity: 0.0998 0.7339 0.4341 0.4139 0.1571 0.4409 0.6113 0.7538 0.5135 0.7945 1.1200 0.3341 0.0734 0.7004 0.0325 0.1205 0.0534 2.7472 1.0338 4.5351 0.1925 0.0057 0.0094 0.1200 0.1660 0.1948 2.8722 5.0975 0.1762 10.7860 12.0084 3.0648 0.7060 5.4915 0.8821 0.0043 8.3630 9.5828 0.0467 1.1150 9.3345 12.2276 1.8464 3.1583 3.8849 5.3155 3.3925 3.1605 0.3503 0.6463 6.9666 2.5876 1.6104 9.6261 29.5118 0.2711 7.0879 40.3802 15.8916 0.3714 191.1570 2.3506 0.4096 16.8962 25.5418 482.4110 42.3951 0.6725 0.3021 12.4016 0.1097 13.5266 2.3660 2.3949 22.9118 2.3492 22.2069 0.1896 35.2078 17.7985 1.1857 0.2560 2.3357 1.9730 16.8220 1.3225 3.7185 1.0345 0.3105 0.3383 26.6200 0.8886 2.9695 0.0807 0.1887 1.4187 0.3889 12.0892 12.1583 25.1828 24.6859 1.7788 8.0082 12.0322 6.5321 4.6676 2.5220 13.2848 10.4764 2.4063 1.0715 12.2851 12.3456 3.0045 3.2822 15.0861 13.5247 20.2880 19.2460 96.5095 172.4820 9.4036 19.2685 41.7548 57.6366 40.7049 30.8067 4.3296 0.6396 3.0330 77.6860 6.2500 27.9739 25.1205 12.4950 9.6682 16.7047 39.2842 26.6750 2.7935 16.6145 0.1340 10.3946 2.5211 272.7567 57.4522 50.6421 59.9407 9.8134 3.6036 4.5446 31.3383 27.5631
temp: 298.150 k
press: 1.00000 atm
elementType: 8 8 8 8 6 6 6 6 6 6 6 6 6 6 6 6 6 6 6 6 6 1 1 1 1 1 1 1 1 1 1 1 1 1 1 1 1 1 1 1 1 1 1 1 1 1 1 1 1 1 1 1 1
symmnumber: 1
zpe: 1214549.6 jmol-1
zpe.correction: 0.462598 hartree
zpe.thermalcorrener: 0.489093 hartree
zpe.thermalcorrenthalpy: 0.490038 hartree
zpe.thermalcorrgfe: 0.402211 hartree
zpe.sumelectzpe: -966.194681 hartree
zpe.sumelectthermal: -966.168186 hartree
zpe.sumelectthermalent: -966.167241 hartree
zpe.sumelectthermalfe: -966.255068 hartree
dipole: -0.0602 -0.0789 -2.1687
dipole: 2.1710
quadrupole: -129.4141 -111.3597 -139.0546
quadrupole: -6.7622 -0.0678 -0.5379
quadrupole: -2.8046 15.2498 -12.4451 -6.7622 -0.0678 -0.5379
hfenergy: -966.657279 hartree
pointgroup: C01 [X(C17H32O4)]
dipole: -0.0304784 -0.0056082 -0.8535715 debye
polarizability: 218.4960273|-15.6694054|202.5290402|-0.2353281|0.6655817|172.7684004 unknown
InChI: InChI=1S/C17H32O4/c1-5-9-11-13-17(14-12-10-6-2,15(18)20-7-3)16(19)21-8-4/h5-14H2,1-4H3
charge 0 multiplicity 1
53 atoms
O  -0.298936 2.424189 0.037037
O  0.257149 -2.362851 -0.010087
O  0.839753 1.28493 1.71577
O  -0.774844 -1.22233 1.735992
C  0.005154 0.03478 -0.265158
C  -1.263736 0.144845 -1.185027
C  1.26981 -0.075138 -1.191569
C  -2.627589 0.262228 -0.471082
C  2.634504 -0.224041 -0.485262
C  0.209116 1.266444 0.63691
C  -0.192117 -1.202622 0.630729
C  -3.789702 0.40413 -1.480961
C  3.787856 -0.383963 -1.50256
C  -5.173791 0.505587 -0.800564
C  5.173153 -0.519239 -0.830543
C  -6.332364 0.647688 -1.811414
C  6.321975 -0.685574 -1.848873
C  -0.087682 3.70191 0.787321
C  0.036123 -3.649294 0.721745
C  -1.178672 3.895057 1.844385
C  1.173517 -3.910766 1.712914
H  -1.118694 1.029542 -1.832384
H  -1.265586 -0.747542 -1.842723
H  1.281213 0.826854 -1.836236
H  1.109907 -0.9476 -1.851924
H  -2.618473 1.14264 0.200045
H  -2.807704 -0.621396 0.17119
H  2.835353 0.65057 0.162593
H  2.611262 -1.108827 0.180091
H  -3.624638 1.304294 -2.109687
H  -3.786975 -0.464135 -2.173718
H  3.600175 -1.276499 -2.135817
H  3.799884 0.488443 -2.189999
H  -5.336977 -0.393576 -0.172252
H  -5.175526 1.371472 -0.107485
H  5.158877 -1.387014 -0.139947
H  5.360806 0.373968 -0.200651
H  -7.310771 0.714322 -1.300906
H  -6.210616 1.557671 -2.429111
H  -6.367206 -0.219856 -2.497375
H  6.372973 0.182758 -2.532804
H  7.301638 -0.776534 -1.344563
H  6.174907 -1.590806 -2.468019
H  -0.12769 4.472227 0.000481
H  0.91533 3.675834 1.248774
H  0.003298 -4.401187 -0.08316
H  -0.938873 -3.596108 1.237625
H  -1.048669 4.875421 2.339418
H  -1.117209 3.108251 2.614212
H  -2.182228 3.870605 1.385132
H  1.0352 -4.900788 2.186073
H  1.181215 -3.146653 2.507768
H  2.151721 -3.906422 1.20136
