program: Gaussian 09
title: 000249296
version: EM64L-G09RevD.01
frameworkgroup: C1[X(C15H26O4)]
method: RPBEPBE
basis: SDD
operation: Freq
keyword: #pfreq=noraman
keyword: PBEPBE/SDD
title: #p freq=noraman PBEPBE/SDD
converged: YES YES NO NO
title: Mulliken charges:
elementType: O O O O C C C C C C C C C C C C C C C H H H H H H H H H H H H H H H H H H H H H H H H H H
charge: -0.279377 -0.275304 -0.215976 -0.227247 0.103094 -0.414751 -0.376460 -0.482625 0.207221 0.199030 -0.350888 -0.162664 -0.702365 -0.182001 -0.262227 -0.260727 -0.737449 -0.666963 -0.664673 0.201274 0.218864 0.233811 0.202588 0.211972 0.227497 0.194211 0.191698 0.245892 0.210474 0.213992 0.215552 0.210987 0.236245 0.219409 0.233884 0.221301 0.225598 0.219211 0.222583 0.222529 0.257041 0.216180 0.222077 0.261603 0.215879
chargesum: 0.00000
title: Mulliken charges with hydrogens summed into heavy atoms:
elementType: O O O O C C C C C C C C C C C C C C C
charge: -0.279377 -0.275304 -0.215976 -0.227247 0.103094 0.005387 0.059938 -0.043156 0.207221 0.199030 0.035021 0.083228 -0.062347 0.028986 0.193427 0.194459 -0.070057 0.028787 0.034886
polarizability: 1.96840105e+02 1.97260604e+00 1.86620095e+02 4.43637848e-01 -2.19494072e+00 1.45970844e+02
1716.lowfreq: -8.0446 -0.0006 -0.0002 0.0005 2.6152 8.5935 25.0787 29.3546 34.6583
frequency: 24.7394 29.0133 34.4870 40.9278 46.0276 47.6577 56.7835 77.3555 88.1231 97.7610 104.9358 127.8496 133.8087 158.7963 181.1070 186.9363 197.6274 208.5259 220.8687 226.4085 244.7281 248.7897 269.9860 276.9989 301.0640 318.2459 330.5962 357.1241 415.1620 422.9594 444.5404 498.3968 532.1151 577.9582 647.1145 703.6276 724.8335 727.9854 745.8606 758.8847 783.1344 795.4971 816.1046 820.2482 838.9021 868.5512 895.1765 903.0530 928.2931 974.7044 983.7026 991.3211 1010.9579 1018.9688 1041.0225 1045.6856 1064.3142 1078.7510 1085.3815 1096.1533 1098.1011 1099.3106 1111.7411 1122.1181 1143.0266 1156.1195 1156.8262 1179.5296 1209.9007 1254.1986 1261.6984 1277.0712 1278.5803 1279.2022 1290.5641 1294.5993 1313.0809 1325.9259 1340.2532 1354.1846 1355.7198 1363.1621 1388.8273 1389.7521 1392.9366 1393.3696 1444.3956 1455.7999 1456.1349 1460.6554 1461.0296 1462.0332 1463.4625 1467.1427 1470.5401 1476.8215 1477.0416 1484.2330 1484.7781 1487.4048 1617.5782 1648.7830 1689.7386 2959.0952 2964.5279 2971.7805 2972.9186 2990.3755 2991.7231 2992.5878 2993.8358 3004.6740 3028.0964 3028.3774 3034.0178 3038.2990 3055.9431 3060.9969 3064.3658 3070.7160 3071.9343 3085.7748 3086.1220 3086.5540 3092.3484 3093.7631 3110.4426 3117.7472 3118.5408
redmass: 4.6957 2.8852 2.0409 2.7507 2.9646 3.2514 3.0194 3.0804 2.6814 2.6034 4.9907 2.2795 2.6179 3.1115 1.8060 2.5290 1.4586 1.6439 1.5919 1.2199 3.0043 1.8878 5.7912 3.2466 2.6290 2.5958 2.9271 6.2366 2.9083 3.0315 3.3756 3.3693 5.1460 3.4721 2.8344 4.6012 4.0195 1.1898 2.9456 2.1723 1.5390 1.4530 1.4736 1.4906 3.3660 2.2968 1.8224 1.7100 1.3816 1.6779 1.1758 4.2079 2.8088 3.0062 3.2108 1.5431 3.9046 2.3855 2.8583 2.1639 2.7096 2.5323 1.6751 2.9662 5.3585 1.6666 1.6772 1.9871 1.3849 1.2762 1.4474 1.2692 1.1156 1.1321 1.1916 1.1887 1.3480 1.3896 1.3873 1.3024 1.2934 1.4410 1.2327 1.2152 1.2298 1.2401 1.0898 1.0930 1.0903 1.0798 1.0512 1.0494 1.0450 1.0666 1.0573 1.0618 1.0514 1.0517 1.0516 1.0799 10.1913 10.5951 6.1364 1.0588 1.0366 1.0544 1.0438 1.0624 1.0361 1.0362 1.0589 1.0974 1.0593 1.0591 1.0979 1.0971 1.1019 1.1016 1.0917 1.0997 1.1009 1.0980 1.0982 1.0981 1.1029 1.1030 1.0898 1.1059 1.1056
irintensity: 1.3698 0.3321 0.1747 0.0213 0.1985 1.1100 1.0194 1.2214 0.6779 0.3751 0.1923 1.3542 1.7137 0.1580 1.1367 2.0837 1.2858 1.1936 0.9722 0.1245 0.2954 0.2371 2.4902 1.5699 7.8265 4.9213 2.4788 15.1715 0.8769 1.6865 1.2771 5.1518 13.2703 10.2050 0.4384 3.2196 0.9674 10.4949 5.9349 5.7913 1.7673 1.0118 3.6161 2.2417 3.5642 1.5520 6.1004 3.9574 5.3555 85.9883 46.4926 21.9942 16.0614 249.4748 20.8784 0.6920 23.4019 339.5257 51.9751 11.8951 4.2974 13.8586 7.9161 4.9081 12.6465 21.2617 6.9388 50.2005 3.9622 4.1492 35.0798 2.8594 3.5152 0.8504 3.5562 2.8318 11.6602 15.8919 7.5935 1.0518 0.8898 0.5799 24.2879 11.8318 13.0577 23.4415 5.8685 8.3431 11.7555 25.2328 7.8726 8.2509 13.8911 1.3550 17.2905 7.5501 7.6132 16.9071 16.5739 13.3522 100.8670 170.1117 1.6868 29.0507 43.4667 28.7185 22.3322 22.6916 22.0366 18.2663 37.9178 15.1665 43.2929 19.8394 0.6533 27.3779 5.4134 9.8865 4.7757 67.0381 97.4198 26.1256 72.9824 9.3809 3.5426 4.2267 29.4267 30.0677 29.1474
temp: 298.150 k
press: 1.00000 atm
elementType: 8 8 8 8 6 6 6 6 6 6 6 6 6 6 6 6 6 6 6 1 1 1 1 1 1 1 1 1 1 1 1 1 1 1 1 1 1 1 1 1 1 1 1 1 1
symmnumber: 1
zpe: 1006654.9 jmol-1
zpe.correction: 0.383415 hartree
zpe.thermalcorrener: 0.407497 hartree
zpe.thermalcorrenthalpy: 0.408441 hartree
zpe.thermalcorrgfe: 0.327140 hartree
zpe.sumelectzpe: -886.552849 hartree
zpe.sumelectthermal: -886.528767 hartree
zpe.sumelectthermalent: -886.527822 hartree
zpe.sumelectthermalfe: -886.609123 hartree
dipole: 0.2911 0.5878 -2.0567
dipole: 2.1588
quadrupole: -110.7143 -98.4122 -122.5926
quadrupole: -7.2824 1.2294 1.8735
quadrupole: -0.1413 12.1608 -12.0195 -7.2824 1.2294 1.8735
hfenergy: -886.9362632 hartree
pointgroup: C01[X(C15H26O4)]
dipole: -0.2079924 0.0078485 -0.823442 debye
polarizability: 190.3958371|-5.5846997|192.6015768|4.2590292|2.342971|146.43363 unknown
InChI: InChI=1S/C15H26O4/c1-5-9-11-15(12-10-6-2,13(16)18-7-3)14(17)19-8-4/h5,9H,6-8,10-12H2,1-4H3
charge 0 multiplicity 1
45 atoms
O  -1.262753 -1.72411 -0.330848
O  1.306036 2.30406 -0.319509
O  -1.140445 -0.191157 1.418613
O  1.727237 0.704434 1.314941
C  0.277011 0.112459 -0.609465
C  1.234445 -0.903288 -1.334172
C  2.037729 -1.869133 -0.437185
C  -0.547049 0.875315 -1.715748
C  -0.741478 -0.593305 0.306297
C  1.147546 1.040722 0.259498
C  2.919104 -2.823057 -1.276579
C  -1.615781 1.814772 -1.200272
C  3.72522 -3.808661 -0.403624
C  -2.938115 1.690516 -1.485807
C  -2.329237 -2.46626 0.411232
C  2.181783 3.264218 0.425346
C  -4.024615 2.621657 -0.997543
C  -1.709119 -3.471753 1.385407
C  1.378822 4.001042 1.500567
H  1.930536 -0.310156 -1.96285
H  0.604231 -1.49816 -2.021904
H  2.671196 -1.306026 0.272526
H  1.336733 -2.469086 0.176367
H  -1.009719 0.105389 -2.36063
H  0.18655 1.435715 -2.32575
H  2.278896 -3.390898 -1.982734
H  3.616217 -2.225478 -1.900051
H  -1.272625 2.644129 -0.566275
H  3.051237 -4.442339 0.20312
H  4.353817 -4.477174 -1.020427
H  4.389772 -3.26578 0.294508
H  -3.263772 0.851005 -2.121685
H  -2.961376 -1.732222 0.941126
H  -2.904279 -2.96103 -0.388043
H  3.020845 2.700051 0.869145
H  2.548454 3.942505 -0.361768
H  -3.610318 3.427367 -0.36631
H  -4.564187 3.089716 -1.844274
H  -4.780206 2.074229 -0.400593
H  -1.042318 -4.175003 0.856749
H  -1.133109 -2.950174 2.167849
H  -2.508779 -4.056628 1.876983
H  0.515783 4.52838 1.058251
H  1.013698 3.29602 2.265649
H  2.022882 4.749675 1.998374
