program: Gaussian 09
title: 000249291
version: EM64L-G09RevD.01
frameworkgroup: C1[X(C13H14O)]
method: RPBEPBE
basis: SDD
operation: Freq
keyword: #pfreq=noraman
keyword: PBEPBE/SDD
title: #p freq=noraman PBEPBE/SDD
converged: YES YES NO NO
title: Mulliken charges:
elementType: O C C C C C C C C C C C C C H H H H H H H H H H H H H H
charge: -0.227535 -0.419848 -0.407361 -0.504507 -0.449706 0.270098 -0.339777 -0.003212 0.302002 -0.375417 -0.366444 -0.237250 -0.231913 -0.231670 0.201285 0.210573 0.208789 0.209731 0.234717 0.241025 0.223679 0.218703 0.249901 0.262921 0.269280 0.229219 0.231225 0.231493
chargesum: 0.00000
title: Mulliken charges with hydrogens summed into heavy atoms:
elementType: O C C C C C C C C C C C C C
charge: -0.227535 -0.007990 0.011159 -0.028765 -0.007324 0.270098 -0.089876 -0.003212 0.302002 -0.112496 -0.097165 -0.008031 -0.000688 -0.000177
polarizability: 1.88172355e+02 -1.94884160e+00 1.41501337e+02 -5.36665001e+00 -7.26900925e+00 9.00521485e+01
1716.lowfreq: -12.2726 -5.9945 -0.0004 0.0002 0.0008 8.1120 42.5400 61.8969 81.8969
frequency: 42.4920 61.8850 81.8840 106.0233 156.1875 221.8212 239.7284 261.4313 290.0309 356.7321 406.6453 409.4760 431.8973 473.1785 518.9299 570.1322 614.1911 658.1393 686.2328 704.6714 745.4158 788.7902 798.0379 826.9095 855.8180 863.7936 888.7653 926.1340 937.5271 942.2380 969.3491 985.6186 989.1367 1001.9715 1025.2501 1066.8701 1077.0952 1083.2032 1104.5573 1124.9227 1132.3243 1171.2254 1173.3924 1186.4965 1231.5371 1253.2359 1275.9971 1310.0539 1316.3441 1334.2549 1339.4167 1348.1218 1375.4219 1381.3069 1431.9277 1443.7155 1452.7155 1470.1186 1474.4937 1475.0554 1526.9071 1585.4783 1607.0348 1641.2554 2945.1164 2977.0231 2982.2168 2985.4442 3006.9627 3033.7997 3042.3794 3051.1495 3116.0819 3125.9457 3136.4525 3148.5569 3157.7282 3168.0193
redmass: 3.9185 3.5596 3.1882 3.8385 3.1514 4.4250 2.7975 3.5790 2.2553 5.0136 2.8403 3.1140 3.0450 2.7926 3.9472 3.9478 6.4472 4.5972 3.5517 1.5330 2.8362 1.8965 1.4291 3.7495 1.5609 1.5070 2.3715 1.4199 2.2490 1.4178 2.9514 1.4011 5.7924 1.3340 2.2729 1.8984 1.8845 1.5956 1.4570 2.0789 1.3904 1.5323 1.0575 1.1179 1.3420 1.4378 1.9911 1.3227 1.3157 1.4353 1.6503 1.5761 2.0928 8.4400 2.2620 1.1024 1.0819 1.0876 1.1002 2.2155 10.8732 6.1888 6.0679 6.4038 1.0657 1.0638 1.0642 1.0636 1.0895 1.0956 1.0991 1.1037 1.0903 1.0850 1.0882 1.0925 1.0960 1.1010
irintensity: 1.3696 0.5265 1.3905 2.3102 0.1792 3.7193 1.6414 0.1462 0.8280 5.0621 0.3087 0.3687 2.5933 2.7092 2.2301 1.1853 0.2509 18.5046 21.3912 86.2490 8.3805 16.5042 8.3372 22.0468 4.8722 1.3238 7.7667 5.6793 10.5640 2.8120 14.3130 3.2860 0.5011 0.7228 3.9235 0.6462 0.7982 13.0878 7.3579 10.6568 3.9999 0.9182 0.0820 11.4134 8.3029 50.6508 132.4829 14.0798 1.1097 10.1697 9.3496 2.4180 12.9518 1.8096 11.8225 11.2365 16.7963 11.3026 8.6142 0.8976 152.3907 4.1576 10.3127 60.1334 23.2640 35.3229 24.6979 10.4019 45.2664 21.5044 58.8504 60.5323 17.5629 0.0596 6.9641 17.7091 21.1583 20.4469
temp: 298.150 k
press: 1.00000 atm
elementType: 8 6 6 6 6 6 6 6 6 6 6 6 6 6 1 1 1 1 1 1 1 1 1 1 1 1 1 1
symmnumber: 1
zpe: 610740.4 jmol-1
zpe.correction: 0.232619 hartree
zpe.thermalcorrener: 0.244753 hartree
zpe.thermalcorrenthalpy: 0.245697 hartree
zpe.thermalcorrgfe: 0.193553 hartree
zpe.sumelectzpe: -577.984981 hartree
zpe.sumelectthermal: -577.972847 hartree
zpe.sumelectthermalent: -577.971903 hartree
zpe.sumelectthermalfe: -578.024047 hartree
dipole: -0.5260 -3.6929 -0.1885
dipole: 3.7350
quadrupole: -69.0159 -86.8936 -82.7684
quadrupole: -0.7506 -1.5544 -2.7591
quadrupole: 10.5434 -7.3342 -3.2091 -0.7506 -1.5544 -2.7591
hfenergy: -578.2175999 hartree
pointgroup: C01 [X(C13H14O1)]
dipole: 0.3149541 1.0093315 -1.020459 debye
polarizability: 186.3435779|4.5059954|124.7165243|13.1641614|-24.8811819|108.6657382 unknown
InChI: InChI=1S/C13H14O/c14-13(11-7-3-1-4-8-11)12-9-5-2-6-10-12/h1,3-4,7-9H,2,5-6,10H2
charge 0 multiplicity 1
28 atoms
O  -0.212306 -1.583556 1.724674
C  3.621988 0.427174 1.174904
C  3.983027 0.294718 -0.32197
C  2.339419 -0.36825 1.504729
C  2.847114 0.861256 -1.206653
C  1.225067 -0.113199 0.497972
C  1.471213 0.446541 -0.728779
C  -0.125267 -0.644751 0.865724
C  -1.384212 -0.099998 0.239378
C  -1.535278 1.265415 -0.124303
C  -2.490729 -0.979636 0.092766
C  -2.7647 1.735372 -0.637462
C  -3.71113 -0.514023 -0.435635
C  -3.851616 0.846471 -0.80379
H  3.469839 1.498366 1.418065
H  4.456456 0.069346 1.806785
H  4.137087 -0.775375 -0.564425
H  4.932123 0.817263 -0.545267
H  1.974269 -0.124764 2.520405
H  2.551827 -1.45541 1.529697
H  2.979488 0.546528 -2.261167
H  2.896975 1.9723 -1.223078
H  0.642005 0.575531 -1.437034
H  -0.705714 1.963604 0.028206
H  -2.371152 -2.021225 0.40894
H  -2.876659 2.793248 -0.900037
H  -4.553798 -1.203809 -0.555782
H  -4.803038 1.211362 -1.207063
