program: Gaussian 09
title: 000249290
version: EM64L-G09RevD.01
frameworkgroup: C1[X(C12H26O3)]
method: RPBEPBE
basis: SDD
operation: Freq
keyword: #pfreq=noraman
keyword: PBEPBE/SDD
title: #p freq=noraman PBEPBE/SDD
converged: YES YES NO NO
title: Mulliken charges:
elementType: O O O C C C C C C C C C C C C H H H H H H H H H H H H H H H H H H H H H H H H H H
charge: -0.283815 -0.293724 -0.291109 -0.372478 -0.369752 -0.385554 -0.472721 -0.372013 -0.353495 0.350431 -0.356492 -0.696688 -0.531465 -0.514968 -0.519003 0.186079 0.191720 0.231041 0.205388 0.196315 0.193103 0.213608 0.227018 0.189332 0.188098 0.188653 0.187662 0.194760 0.194159 0.214541 0.209954 0.209628 0.226907 0.232763 0.213330 0.217939 0.230826 0.242772 0.224855 0.249275 0.203120
chargesum: 0.00000
title: Mulliken charges with hydrogens summed into heavy atoms:
elementType: O O O C C C C C C C C C C C C
charge: -0.283815 -0.293724 -0.291109 0.005321 0.066677 0.003864 -0.032094 0.005418 0.022819 0.350431 0.032427 -0.062566 0.141535 0.176569 0.158247
polarizability: 1.70759355e+02 3.77359587e+00 1.30131339e+02 -2.75294801e-01 1.12759243e+00 1.27994562e+02
1716.lowfreq: -5.5441 -0.0007 -0.0006 0.0006 5.7569 7.0996 26.1059 38.8576 50.3747
frequency: 26.0820 38.7840 49.1326 59.9425 83.3327 90.4406 94.7741 98.7414 113.4228 117.3932 135.2462 148.5585 150.1717 160.6435 173.6998 185.6020 198.2941 232.0673 248.7623 280.2155 296.0909 324.9648 377.0126 379.3123 440.4908 467.7541 506.3933 535.2497 613.8216 709.3812 723.6034 729.3595 746.4792 783.1831 835.5306 885.2173 891.2090 896.5107 952.7811 984.6356 994.0476 999.5894 1006.8289 1021.5796 1026.3954 1049.9121 1070.3137 1079.5153 1080.7202 1112.4308 1115.2617 1116.4744 1121.9715 1132.0990 1145.7323 1154.6094 1175.2311 1193.6843 1202.9962 1216.5212 1229.2008 1258.4683 1265.0475 1282.9548 1289.9906 1294.2873 1296.3706 1301.7407 1330.3241 1350.5343 1354.4825 1358.5734 1388.3607 1417.0102 1425.5501 1428.3768 1447.8412 1451.5538 1460.8410 1461.1250 1463.7704 1465.9918 1469.5577 1471.6707 1477.4429 1477.9479 1479.1040 1481.6581 1485.1074 1486.8983 1489.4958 2945.4557 2949.0073 2951.6640 2959.2274 2959.4633 2964.1408 2967.1684 2970.5558 2982.4366 2987.2232 2989.3448 2989.7865 2995.8940 3001.4878 3019.9937 3035.3783 3041.7344 3049.6962 3065.7425 3067.3427 3069.5033 3069.5737 3092.7286 3103.4951 3116.7073 3120.8460
redmass: 3.7138 3.6142 1.6577 2.9349 2.0378 1.6122 2.7947 2.4614 2.2150 1.4037 1.7813 1.8321 1.6694 2.1819 1.8417 2.2266 2.0130 1.1081 3.3785 2.6725 3.5027 3.3164 3.4301 4.6476 3.1707 3.6667 4.4535 4.3698 4.6181 4.2729 1.0614 1.0856 1.1618 1.3241 1.4282 2.7219 3.1814 1.5573 1.4966 8.9399 4.4948 4.0020 2.6381 3.9680 1.6567 3.1830 2.7387 2.3783 2.1165 1.2686 1.3551 1.2963 2.4126 1.5160 1.4559 1.4487 1.9827 1.7067 3.3204 1.3138 1.4220 1.3105 1.2741 1.0271 1.1448 1.0840 1.3232 1.1442 1.4300 1.5666 1.6753 1.6135 1.2174 1.1291 1.1392 1.1403 1.0724 1.0552 1.0743 1.0702 1.0580 1.0721 1.0622 1.0764 1.0436 1.0689 1.0526 1.0659 1.0524 1.0807 1.0922 1.0589 1.0589 1.0591 1.0517 1.0393 1.0364 1.0587 1.0366 1.0960 1.0761 1.0770 1.0347 1.0615 1.1006 1.1038 1.1031 1.1011 1.1021 1.1015 1.1007 1.0988 1.0977 1.1031 1.1010 1.1039 1.1049
irintensity: 0.0317 0.2538 0.0344 0.9659 4.7980 0.4750 1.7120 2.5261 0.2015 1.8397 0.0698 0.5556 5.7642 3.5149 4.8080 2.9104 4.8735 0.0008 8.0452 1.8099 0.8778 1.3564 13.2168 7.5958 0.9993 4.3556 6.6681 5.8665 3.3780 3.4349 14.0286 0.0557 0.8022 7.6747 5.6632 73.1216 101.7150 19.8363 3.5737 104.6395 21.4067 67.6089 39.3011 4.1039 120.1562 6.8209 6.4233 1.6006 0.4796 1.1471 9.3181 4.6206 20.4089 30.5580 31.9358 3.2709 24.9614 20.4319 95.8391 15.4845 9.1850 9.5507 4.6046 0.0942 5.8223 0.9773 9.5610 10.6162 11.3164 1.7998 1.6556 6.0921 11.1991 7.4181 9.9208 7.2196 3.1135 5.4653 0.1636 0.0583 7.8958 0.4504 2.1181 1.2796 10.2909 13.0563 15.3384 8.1963 10.8415 7.5298 21.2562 7.6804 2.6121 0.0597 9.1032 92.1811 55.0871 132.6130 37.1654 1.1235 2.2163 11.7155 51.7464 48.5399 3.9263 1.8865 83.5496 24.4678 56.2089 62.7270 119.7094 82.8913 14.3611 33.0791 29.5228 21.1654 26.3115
temp: 298.150 k
press: 1.00000 atm
elementType: 8 8 8 6 6 6 6 6 6 6 6 6 6 6 6 1 1 1 1 1 1 1 1 1 1 1 1 1 1 1 1 1 1 1 1 1 1 1 1 1 1
symmnumber: 1
zpe: 954542.7 jmol-1
zpe.correction: 0.363566 hartree
zpe.thermalcorrener: 0.384129 hartree
zpe.thermalcorrenthalpy: 0.385073 hartree
zpe.thermalcorrgfe: 0.312780 hartree
zpe.sumelectzpe: -697.232086 hartree
zpe.sumelectthermal: -697.211523 hartree
zpe.sumelectthermalent: -697.210578 hartree
zpe.sumelectthermalfe: -697.282871 hartree
dipole: -0.2323 -0.7270 -1.1866
dipole: 1.4109
quadrupole: -94.4454 -91.0518 -92.6644
quadrupole: 3.4658 0.0971 -1.3447
quadrupole: -1.7249 1.6687 0.0562 3.4658 0.0971 -1.3447
hfenergy: -697.5956517 hartree
pointgroup: C01 [X(C12H26O3)]
dipole: 0.0876078 -0.2505242 0.4875301 debye
polarizability: 170.7867011|-3.595084|129.9225585|0.435175|-1.3081716|128.1759964 unknown
InChI: InChI=1S/C12H26O3/c1-5-6-7-8-9-10-11-12(13-2,14-3)15-4/h5-11H2,1-4H3
charge 0 multiplicity 1
41 atoms
O  4.010561 -0.342746 0.849357
O  2.938968 -0.529769 -1.295339
O  2.942711 1.470802 -0.119635
C  -1.051175 -0.42295 0.48731
C  0.269989 0.108675 -0.11069
C  -2.305061 0.141392 -0.217864
C  1.509812 -0.443439 0.624591
C  -3.630129 -0.406384 0.358563
C  -4.885567 0.171896 -0.332619
C  2.844217 0.034293 0.020787
C  -6.21015 -0.385055 0.237566
C  -7.459575 0.203224 -0.45322
C  4.171902 -1.785077 1.074738
C  4.079664 -0.044555 -2.10024
C  3.015627 2.238415 1.131401
H  -1.097845 -0.17363 1.568957
H  -1.064646 -1.531661 0.423816
H  0.340085 -0.167668 -1.179631
H  0.281684 1.215671 -0.073169
H  -2.251551 -0.092948 -1.301469
H  -2.301063 1.248812 -0.140052
H  1.488901 -0.147712 1.691746
H  1.492951 -1.548782 0.591844
H  -3.639083 -1.512984 0.267159
H  -3.676364 -0.184798 1.445735
H  -4.837898 -0.042563 -1.42096
H  -4.882295 1.277896 -0.234509
H  -6.21443 -1.489561 0.134323
H  -6.25417 -0.175172 1.32598
H  -8.392435 -0.212352 -0.029285
H  -7.453154 -0.017508 -1.537532
H  -7.495554 1.303017 -0.336484
H  5.192713 -1.909929 1.46988
H  4.06367 -2.347325 0.127949
H  3.444465 -2.16766 1.817474
H  4.127049 -0.725371 -2.964407
H  5.01676 -0.09066 -1.516532
H  3.901641 0.992261 -2.429774
H  3.13842 3.286848 0.817837
H  3.877144 1.914785 1.739508
H  2.082316 2.14017 1.721493
