program: Gaussian 09
title: 000249287
version: EM64L-G09RevD.01
frameworkgroup: C1[X(C10H18O4)]
method: RPBEPBE
basis: SDD
operation: Freq
keyword: #pfreq=noraman
keyword: PBEPBE/SDD
title: #p freq=noraman PBEPBE/SDD
converged: YES YES NO NO
title: Mulliken charges:
elementType: O O O O C C C C C C C C C C H H H H H H H H H H H H H H H H H H
charge: -0.243832 -0.243846 -0.205835 -0.205809 -0.042695 -0.042695 -0.288058 -0.288064 -0.695658 -0.695786 -0.695665 -0.695779 0.172542 0.172535 0.220787 0.220800 0.226349 0.233666 0.226345 0.233680 0.215344 0.211132 0.240566 0.224703 0.213751 0.213020 0.215345 0.211112 0.240580 0.224702 0.213755 0.213005
chargesum: 0.00000
title: Mulliken charges with hydrogens summed into heavy atoms:
elementType: O O O O C C C C C C C C C C
charge: -0.243832 -0.243846 -0.205835 -0.205809 0.178092 0.178105 0.171957 0.171961 -0.028615 -0.044312 -0.028629 -0.044316 0.172542 0.172535
polarizability: 1.65524763e+02 7.14850680e-04 1.01860111e+02 -2.08632510e+00 -4.65836217e-03 1.05610362e+02
1716.lowfreq: 0.0003 0.0004 0.0006 4.1480 6.8877 11.5066 18.4353 31.7690 33.6609
frequency: 18.4349 31.7368 33.6464 46.3855 54.4826 57.2670 72.2916 175.3191 188.1362 202.1113 203.4258 236.8231 237.3072 245.7571 256.6315 295.5294 304.3299 354.3300 355.6784 389.1624 410.9184 416.1745 453.0623 510.7474 637.1629 709.5076 748.4756 797.1819 812.1555 813.1044 865.0470 896.8002 918.6661 922.5968 922.9870 942.5323 952.6332 956.7134 965.4433 967.1762 1083.0622 1134.1655 1134.6801 1166.6609 1168.9347 1185.4797 1185.6345 1218.2241 1249.6150 1251.1013 1293.1035 1293.8016 1344.5982 1345.8049 1355.8583 1360.0621 1379.9674 1380.2383 1398.6082 1399.3103 1457.2281 1457.5200 1469.5180 1469.9788 1471.9605 1472.0907 1483.0705 1483.1359 1493.6654 1493.9265 1625.6534 1641.2318 2974.1091 2974.1915 2979.5751 2979.7382 2994.3588 2994.3910 3016.7763 3017.0325 3066.6161 3066.6676 3074.4158 3074.5525 3081.3190 3081.3700 3084.7425 3084.9087 3096.4697 3096.5453
redmass: 4.1549 5.5012 2.9314 5.6574 3.1696 4.2121 3.2029 4.7442 3.3504 1.0881 1.1134 1.6033 1.7480 1.4777 1.8467 3.5410 3.8660 2.7156 2.7220 3.9322 1.8853 2.3015 3.6210 4.3577 9.4551 5.8463 10.5426 5.6723 2.6652 2.6568 5.1177 2.0407 1.3903 1.1890 1.2075 1.8006 1.7951 2.3917 1.5559 1.6555 6.3670 2.2693 2.2937 1.8760 1.9795 1.8514 1.8500 4.8363 1.2086 1.2723 1.3364 1.3638 1.4066 1.4284 1.3635 1.4024 1.2053 1.2054 1.2093 1.2122 1.0820 1.0826 1.0591 1.0572 1.0505 1.0516 1.0561 1.0560 1.0489 1.0489 10.6390 10.9178 1.0355 1.0355 1.0365 1.0365 1.0836 1.0837 1.0574 1.0574 1.1000 1.1000 1.1000 1.1000 1.0990 1.0991 1.0995 1.0994 1.1080 1.1081
irintensity: 1.3980 1.8982 0.5389 0.9518 0.0071 0.7438 0.1451 0.2152 1.2344 0.0968 0.0009 1.3684 0.7952 0.8475 0.5878 0.0266 24.1872 2.1892 18.8466 1.3054 0.6062 5.3354 4.8997 12.6751 10.9347 15.7071 2.0668 0.7995 8.2686 1.4421 14.8690 3.5093 7.8565 2.7452 22.7404 0.8716 46.9858 3.4251 2.0960 0.1811 803.5127 0.0025 0.4575 0.8088 23.5635 4.3158 2.7665 30.4277 21.7964 5.2602 0.5317 0.6777 2.3248 1.8940 4.7076 0.5046 21.6590 13.3329 6.1703 21.2819 15.5725 0.2460 20.3004 0.0084 8.3634 3.2019 8.3057 13.6321 49.1380 3.9691 334.8074 55.4758 57.5276 10.9120 8.8038 26.4450 14.6764 8.9156 44.6308 18.6700 23.0905 32.8790 19.6166 15.8794 50.6380 59.8623 57.1781 11.0031 20.8907 29.2473
temp: 298.150 k
press: 1.00000 atm
elementType: 8 8 8 8 6 6 6 6 6 6 6 6 6 6 1 1 1 1 1 1 1 1 1 1 1 1 1 1 1 1 1 1
symmnumber: 1
zpe: 702588.0 jmol-1
zpe.correction: 0.267602 hartree
zpe.thermalcorrener: 0.284965 hartree
zpe.thermalcorrenthalpy: 0.285910 hartree
zpe.thermalcorrgfe: 0.219650 hartree
zpe.sumelectzpe: -691.622174 hartree
zpe.sumelectthermal: -691.604810 hartree
zpe.sumelectthermalent: -691.603866 hartree
zpe.sumelectthermalfe: -691.670125 hartree
dipole: 0.0001 -0.9870 -0.0012
dipole: 0.9870
quadrupole: -60.7920 -83.9156 -93.6127
quadrupole: 0.0009 0.3193 0.0075
quadrupole: 18.6481 -4.4755 -14.1726 0.0009 0.3193 0.0075
hfenergy: -691.8897757 hartree
pointgroup: C01 [X(C10H18O4)]
dipole: -0.0002862 -0.003814 0.3882884 debye
polarizability: 165.5773868|-1.0933464|105.5573567|0.0423999|0.0356194|101.8604922 unknown
InChI: InChI=1S/C10H18O4/c1-7(2)5-13-9(11)10(12)14-6-8(3)4/h7-8H,5-6H2,1-4H3
charge 0 multiplicity 1
32 atoms
O  -1.677751 0.230335 0.907661
O  1.676239 -0.248764 0.905963
O  -0.665513 -1.594457 -0.168565
O  0.66566 1.595909 -0.137459
C  -3.972997 0.362375 -0.037183
C  3.972987 -0.363785 -0.037366
C  -3.026977 -0.423556 0.888522
C  3.025521 0.405241 0.901009
C  -3.462013 0.375462 -1.494865
C  -5.388356 -0.257697 0.067999
C  3.464505 -0.349922 -1.495925
C  5.388237 0.253951 0.081536
C  -0.62385 -0.450823 0.331746
C  0.623286 0.443004 0.341014
H  -4.015312 1.406664 0.331775
H  4.014497 -1.414704 0.31236
H  -3.365208 -0.389972 1.937947
H  -2.908897 -1.471171 0.555685
H  3.362013 0.352484 1.950201
H  2.907985 1.458745 0.587151
H  -4.163431 0.928987 -2.145038
H  -3.368314 -0.653674 -1.890356
H  -2.47605 0.867213 -1.570072
H  -6.103453 0.312471 -0.551324
H  -5.763219 -0.252761 1.108847
H  -5.391158 -1.303791 -0.293244
H  4.167126 -0.891269 -2.154998
H  3.37149 0.686379 -1.87251
H  2.478729 -0.840275 -1.582036
H  6.10429 -0.304835 -0.546986
H  5.761362 0.229807 1.122734
H  5.39177 1.306524 -0.260424
