program: Gaussian 09
title: 000249284
version: EM64L-G09RevD.01
frameworkgroup: C1[X(C8H15NO2)]
method: RPBEPBE
basis: SDD
operation: Freq
keyword: #p
keyword: freq=noraman
keyword: PBEPBE/SDD
title: #p freq=noraman PBEPBE/SDD
converged: YES YES NO NO
title: Mulliken charges:
elementType: O O N C C C C C C C C H H H H H H H H H H H H H H H
charge: -0.320837 -0.460321 -0.103055 -0.403153 -0.377886 -0.370469 -0.393706 -0.406491 0.185038 -0.124918 -0.675482 0.226170 0.193284 0.207802 0.213826 0.207208 0.206997 0.211644 0.271154 0.225803 0.222800 0.218219 0.200976 0.233198 0.247797 0.364403
chargesum: 0.00000
title: Mulliken charges with hydrogens summed into heavy atoms:
elementType: O O N C C C C C C C C
charge: -0.320837 -0.095918 -0.103055 0.016301 0.043741 0.043736 0.089092 0.042112 0.185038 0.093301 0.006489
polarizability: 1.19628127e+02 3.22413295e+00 9.63662444e+01 -3.18775429e+00 -2.84155146e+00 7.69735508e+01
1716.lowfreq: -25.3018 -4.0336 -0.0007 -0.0003 -0.0002 6.9563 52.8800 78.2994 99.7348
frequency: 52.7870 78.0323 99.7049 149.1716 223.6173 240.5185 260.6286 273.5758 324.8445 365.2986 389.9488 418.7776 436.7099 479.9434 521.7020 528.6942 608.5506 690.1893 735.3388 801.7274 822.0059 848.2734 869.7393 895.9362 931.4270 950.0471 1003.8715 1014.2943 1042.2317 1065.7970 1089.3840 1105.0166 1122.5345 1138.8004 1156.2548 1223.0298 1232.5188 1246.6220 1258.0284 1276.2125 1314.1791 1329.7625 1337.7995 1344.2502 1347.6486 1358.0300 1380.4575 1390.2902 1431.3875 1455.0467 1461.2719 1464.7755 1466.4709 1469.3431 1476.3865 1484.1577 1578.1997 2958.5436 2965.6919 2970.6941 2985.9377 2986.7057 2990.0813 3006.1102 3041.3741 3048.9264 3057.6784 3084.0355 3092.4088 3100.5558 3101.8608 3358.2422
redmass: 3.5751 3.8249 4.5123 3.0647 1.1252 2.5126 2.0926 2.6235 4.0769 4.2561 2.0309 2.8127 2.8902 2.5531 1.2107 2.2290 2.9061 5.1291 2.9868 1.5352 2.9665 1.4333 2.8539 2.3506 2.5657 1.3303 2.2317 2.1616 2.0728 2.6696 1.4545 1.9064 2.4072 2.0452 1.2717 1.3772 1.9162 1.7622 1.2824 1.1795 1.2755 1.2687 1.3551 1.4633 1.4449 1.3734 1.2686 1.2439 2.7052 1.0965 1.1024 1.0891 1.0839 1.0761 1.0824 1.0869 5.8277 1.0709 1.0691 1.0648 1.0607 1.0354 1.0610 1.0849 1.0958 1.1023 1.1031 1.0988 1.0942 1.0916 1.1006 1.0637
irintensity: 0.5686 0.8667 1.3866 0.5779 0.3393 1.4407 1.4745 1.0186 1.7203 33.3317 3.8931 12.1159 10.9312 15.6631 95.1718 13.6617 1.6493 12.6103 13.4603 0.0150 5.3099 16.0760 1.7368 7.3389 1.9630 6.1388 18.1717 97.0697 1.4596 44.3852 0.6446 77.2482 4.6845 0.3280 2.4023 2.1260 10.1705 131.3686 8.3397 18.9555 3.6040 8.4622 1.5214 11.7117 6.7022 9.8282 68.2717 122.7281 22.7920 5.8600 23.5880 9.5901 23.4564 8.7427 10.2060 10.8512 227.9578 28.0559 44.4444 43.7173 30.1684 18.3431 29.8278 35.4215 51.7535 34.0964 81.1966 44.9190 5.5456 21.7931 17.3767 62.0617
temp: 298.150 k
press: 1.00000 atm
elementType: 8 8 7 6 6 6 6 6 6 6 6 1 1 1 1 1 1 1 1 1 1 1 1 1 1 1
symmnumber: 1
zpe: 591015.6 jmol-1
zpe.correction: 0.225106 hartree
zpe.thermalcorrener: 0.236381 hartree
zpe.thermalcorrenthalpy: 0.237325 hartree
zpe.thermalcorrgfe: 0.188196 hartree
zpe.sumelectzpe: -518.167868 hartree
zpe.sumelectthermal: -518.156594 hartree
zpe.sumelectthermalent: -518.155649 hartree
zpe.sumelectthermalfe: -518.204778 hartree
dipole: 5.2593 2.4431 -0.3525
dipole: 5.8098
quadrupole: -76.8509 -68.5206 -66.3111
quadrupole: -3.0821 -2.5838 0.0803
quadrupole: -6.2900 2.0403 4.2497 -3.0821 -2.5838 0.0803
hfenergy: -518.3929742 hartree
pointgroup: C01 [X(C8H15N1O2)]
dipole: 2.076142 0.9509322 -0.0997573 debye
dipolederiv: -0.9252896 -0.0814216 0.0757112 -0.5072366 -0.9302622 0.1135912 0.2100141 0.1499174 -0.3803856 -0.7552298 -0.208021 -0.0253189 -0.0509638 -0.4581839 -0.1462376 -0.0134159 -0.1279719 -0.516813 -1.268538 -0.243787 0.142662 -0.084605 -0.4969518 0.0275127 0.0387295 0.0448869 -0.3429686 0.0875133 0.0029837 -0.0271517 -0.0176613 0.0363441 0.0186757 -0.0552106 0.0136418 0.13884 0.0527395 -0.0005565 -0.0376576 0.0276983 0.0602986 -0.0125636 -0.0165075 -0.0106326 0.0887288 0.0529556 -0.0122337 -0.0368846 -0.0044888 0.0445341 -0.0007513 -0.0360478 0.0064772 0.0848015 0.2904827 -0.1850899 -0.0090566 -0.3595312 0.171202 0.0767036 0.0518884 0.0748924 0.2722295 0.2000985 0.1632063 -0.0883883 0.2633368 0.356106 -0.0642241 -0.0969178 -0.0645291 0.3260333 1.5165146 0.2304867 -0.3052029 0.4899351 0.8381953 -0.1324713 -0.3700681 -0.2170362 0.1441065 0.4120958 0.240564 0.0397723 0.3086574 0.2108488 0.0426164 0.0415352 0.043668 0.4116367 -0.0167363 0.0443444 0.0020072 0.0244144 -0.0265336 -0.0893443 -0.0877875 -0.0706337 -0.0858357 -0.1086439 -0.0556847 -0.1095774 -0.064688 0.0291774 -0.0394662 -0.1520335 -0.0462404 -0.0131501 0.0265014 0.017543 0.0712252 0.03961 0.0217386 -0.0179675 0.1504302 -0.0021832 -0.1414873 -0.0958711 0.1313938 -0.0192224 0.1219267 -0.0902193 0.0202966 -0.0128268 -0.0022702 0.0872435 0.0366121 -0.0340637 0.091563 -0.0296995 0.0528871 -0.0458474 0.0477758 -0.0039135 -0.1336791 0.0101339 0.0522992 0.0739448 0.0286533 0.0687346 -0.0157353 0.0693697 -0.0653691 -0.1283702 -0.0018732 -0.0859011 0.0193691 -0.0839459 -0.1531217 0.0714998 0.0186397 0.0961787 0.0518231 -0.0522185 0.0693314 0.0671157 0.068812 0.0761711 0.0078766 0.0751297 -0.0702511 -0.1513339 0.1016552 -0.0960392 0.0065751 -0.0060786 -0.0056555 0.0164885 -0.014637 0.0370798 0.086923 -0.051816 0.1097553 -0.0417426 0.0814358 -0.0262723 0.0167181 -0.0274757 0.0049968 0.0848749 -0.0078571 -0.0602213 0.1098422 -0.049478 0.0170524 -0.0597731 0.1016828 0.0260008 -0.1493696 0.0126814 -0.0394927 0.0430034 -0.0425849 -0.0345808 0.071317 0.0730665 0.0814931 -0.1168462 -0.1093195 -0.1390045 -0.0183631 -0.144538 0.0121044 -0.0153243 -0.010909 0.0030632 0.0652192 0.1036117 -0.0020274 0.0008966 -0.0313894 0.0135385 0.1194609 0.0016153 0.0542575 -0.0618707 -0.0386476 0.1273237 0.0201308 0.127029 -0.0159137 -0.0224735 0.0157187 -0.0238194 0.0818953 0.5284448 0.0543127 -0.0452526 -0.1046198 0.2287619 0.0594225 -0.0017583 0.0682967 0.2977546 unknown
polarizability: 119.5967494|3.2223726|96.6094148|-3.5485032|-1.491932|76.7617583 unknown
InChI: InChI=1S/C8H15NO2/c1-7(10)8(11)9-5-3-2-4-6-9/h7,10H,2-6H2,1H3
charge 0 multiplicity 1
26 atoms
O  -1.449401 -1.733791 0.208776
O  -3.430067 -0.061241 -0.209022
N  0.264751 -0.282523 -0.408096
C  3.037774 0.415521 0.202343
C  2.430817 -0.942225 0.630619
C  1.936094 1.496413 0.093053
C  1.282511 -1.35898 -0.31489
C  0.797056 1.027842 -0.844215
C  -1.052582 -0.561155 -0.120669
C  -2.11769 0.570046 -0.152397
C  -2.021657 1.467642 1.105704
H  3.81761 0.734526 0.918538
H  3.53487 0.29983 -0.783406
H  3.205352 -1.732357 0.627659
H  2.038549 -0.869505 1.663586
H  1.51608 1.704463 1.096902
H  2.35657 2.444022 -0.294404
H  1.683495 -1.554759 -1.331506
H  0.769397 -2.268039 0.036333
H  -0.011024 1.773252 -0.880326
H  1.195024 0.917937 -1.875562
H  -2.018097 1.180384 -1.069642
H  -1.08519 2.055008 1.140626
H  -2.084171 0.847883 2.017503
H  -2.876126 2.16535 1.10499
H  -3.278043 -1.013347 0.070805
