program: Gaussian 09
title: 000249279
version: EM64L-G09RevD.01
frameworkgroup: C1[X(C20H24O)]
method: RPBEPBE
basis: SDD
operation: Freq
keyword: #pfreq=noraman
keyword: PBEPBE/SDD
title: #p freq=noraman PBEPBE/SDD
converged: YES YES NO NO
title: Mulliken charges:
elementType: O C C C C C C C C C C C C C C C C C C C C H H H H H H H H H H H H H H H H H H H H H H H H
charge: -0.201688 0.054058 0.392349 0.381671 0.528935 -0.632019 -0.631480 -0.571547 -0.549148 0.037806 -0.545787 -0.647691 -0.683288 -0.693426 0.471976 -0.674193 -0.388614 -0.407865 -0.229305 -0.227511 -0.242769 0.243035 0.245185 0.226642 0.215299 0.208974 0.235184 0.208237 0.209950 0.244370 0.222052 0.221553 0.216093 0.242958 0.259459 0.213192 0.210976 0.222721 0.224461 0.216926 0.258823 0.233345 0.226523 0.225444 0.228134
chargesum: 0.00000
title: Mulliken charges with hydrogens summed into heavy atoms:
elementType: O C C C C C C C C C C C C C C C C C C C C
charge: -0.201688 0.054058 0.392349 0.381671 0.528935 -0.388984 -0.386296 -0.129605 -0.104990 0.037806 -0.127599 -0.181268 -0.002684 -0.009799 0.471976 -0.010086 -0.129791 -0.174520 -0.002782 -0.002067 -0.014636
polarizability: 2.58917559e+02 -1.20752034e+01 2.09191025e+02 2.56456592e+01 5.90925757e+00 1.78776463e+02
1716.lowfreq: -11.1385 -8.0151 -5.0009 -0.0002 0.0002 0.0008 11.2153 15.4996 28.2412
frequency: 10.7268 14.9772 27.8827 34.3665 47.8332 53.0030 84.0679 90.0355 94.0362 136.1939 142.5999 160.4705 198.1291 205.7714 217.4891 228.1472 268.0072 274.5525 286.6597 304.4374 312.7932 324.7971 361.3143 402.4284 446.3410 469.3965 493.6000 507.5117 524.5828 547.1082 573.3538 616.2427 625.1456 636.8599 663.1519 696.9415 715.8997 759.1903 780.8176 786.7842 790.0041 798.3297 833.0137 852.8860 885.7707 892.9345 896.6425 909.6275 922.4926 931.6914 966.6538 977.0006 988.3605 994.5813 998.7160 1004.4387 1011.4720 1026.0675 1056.2470 1059.0437 1062.2631 1073.0117 1078.0542 1081.0239 1087.1170 1136.7011 1171.9321 1176.5365 1186.9579 1196.6028 1229.4251 1235.9481 1244.4002 1246.2866 1262.4304 1271.5492 1282.8859 1305.9227 1308.5135 1327.7170 1328.1606 1367.9561 1382.5883 1383.2052 1387.3560 1390.5831 1422.8235 1440.7353 1453.2243 1458.0157 1469.9067 1471.3192 1471.8558 1474.8261 1477.2809 1480.9341 1482.3096 1489.7410 1492.5765 1496.5248 1569.7527 1588.0156 1593.7393 1611.0252 1612.7802 2979.4941 2979.8178 2981.6970 2986.1944 2992.6993 2993.9251 3011.1635 3037.4093 3043.3189 3048.2385 3075.2749 3078.1229 3079.5616 3083.8891 3087.7446 3089.0940 3096.5901 3105.1696 3109.4348 3120.5010 3126.9707 3138.8843 3148.8504 3164.5687
redmass: 4.1724 2.5606 3.8686 4.2857 2.6413 3.5175 3.0875 4.3388 3.8353 3.8753 3.8077 3.5988 1.2527 1.5312 2.0127 1.1033 4.3082 4.0900 2.1327 2.2145 2.1900 3.6476 2.5597 2.8169 2.9810 3.2605 3.4451 4.0834 5.6979 4.0770 3.6884 6.2891 3.8495 3.8093 3.1051 2.6155 2.0050 2.1015 1.2136 2.0989 1.6047 1.2429 3.7538 1.2498 2.8085 2.8454 1.5767 1.3719 1.5337 2.3223 2.2740 1.3958 4.8401 1.5292 2.6348 2.3746 2.3303 2.2296 1.9505 2.1052 1.9971 1.4878 1.5514 1.6276 1.6202 1.5363 1.0672 1.3601 1.1110 3.1803 1.4236 1.6072 1.2714 1.3381 1.6544 1.3542 1.7681 1.3983 1.3917 1.9615 1.5864 4.5431 7.6243 1.2346 1.2009 1.2229 3.1692 2.1270 1.1261 2.9553 1.0444 1.0429 1.0416 1.0996 1.0601 2.1892 1.0647 1.0925 1.0955 1.0929 7.6456 8.6696 6.2030 6.2197 6.2945 1.0350 1.0352 1.0350 1.0597 1.0620 1.0599 1.0593 1.1017 1.1007 1.0993 1.0998 1.1001 1.1000 1.1012 1.1033 1.1014 1.1009 1.0907 1.0915 1.0858 1.0871 1.0921 1.0964 1.1016
irintensity: 0.1003 0.0896 0.1019 0.7832 0.1182 0.1792 1.5557 2.3570 3.3833 0.8021 0.9512 0.7897 0.1317 0.8897 0.4316 0.0472 3.3669 0.4476 0.1018 0.3734 0.0463 1.4751 0.1895 0.0083 1.0883 3.4600 1.0628 6.7341 4.7821 9.5276 6.2269 0.1946 5.3637 14.0911 0.8826 12.0592 76.8006 14.3387 2.8176 3.5916 5.0900 1.9748 6.0437 0.4096 8.0510 6.6480 25.2967 0.8241 1.7108 21.0435 0.5905 0.4591 6.5725 3.6156 17.2214 22.1935 3.3156 8.4052 10.7931 20.0646 2.2376 6.2004 1.8466 14.4716 10.7249 6.8175 0.4432 7.4992 0.4621 11.6918 9.0665 50.1797 0.9799 9.7889 73.7889 2.7950 8.7636 1.4400 1.1806 0.2109 9.4893 0.0763 1.6169 7.5119 3.4262 32.8358 6.3357 7.6253 12.2272 9.4610 9.6145 13.3431 16.2089 0.9176 0.9607 21.1613 1.2998 9.6610 12.0837 8.0776 21.0123 92.8071 13.3167 50.8075 17.3313 22.1370 57.5803 43.2239 34.4941 23.6480 30.0738 17.0323 7.5471 14.9630 5.9177 51.8504 65.6934 41.6823 33.8223 19.2877 26.9220 16.4595 27.6400 13.9722 5.2674 0.2717 18.9793 29.7645 22.6411
temp: 298.150 k
press: 1.00000 atm
elementType: 8 6 6 6 6 6 6 6 6 6 6 6 6 6 6 6 6 6 6 6 6 1 1 1 1 1 1 1 1 1 1 1 1 1 1 1 1 1 1 1 1 1 1 1 1
symmnumber: 1
zpe: 1000321.8 jmol-1
zpe.correction: 0.381002 hartree
zpe.thermalcorrener: 0.402734 hartree
zpe.thermalcorrenthalpy: 0.403678 hartree
zpe.thermalcorrgfe: 0.326459 hartree
zpe.sumelectzpe: -850.217156 hartree
zpe.sumelectthermal: -850.195424 hartree
zpe.sumelectthermalent: -850.194480 hartree
zpe.sumelectthermalfe: -850.271699 hartree
dipole: -1.0375 -0.6306 -2.3636
dipole: 2.6572
quadrupole: -116.6766 -118.7940 -130.1299
quadrupole: -3.3503 3.1693 -2.6043
quadrupole: 5.1902 3.0728 -8.2630 -3.3503 3.1693 -2.6043
hfenergy: -850.5981582 hartree
pointgroup: C01 [X(C20H24O1)]
dipole: -0.4519312 -0.1318557 -0.9334265 debye
polarizability: 255.6383525|-19.7407048|212.7685684|23.797416|4.9584773|178.4781249 unknown
InChI: InChI=1S/C20H24O/c1-4-15-12-17(5-2)20(18(6-3)13-15)19(21)14-16-10-8-7-9-11-16/h7-13H,4-6,14H2,1-3H3
charge 0 multiplicity 1
45 atoms
O  0.995048 1.074229 1.989815
C  -0.643612 0.531203 0.278282
C  -1.567031 1.424576 -0.346437
C  -0.977879 -0.84555 0.461285
C  -3.146632 -0.451393 -0.671435
C  -2.801327 0.914308 -0.811194
C  -2.220246 -1.309928 -0.034488
C  -1.318409 2.928293 -0.4136
C  -0.054456 -1.827088 1.174416
C  0.693043 1.040302 0.76407
C  -4.49555 -0.969009 -1.149245
C  1.743345 1.441955 -0.298865
C  -1.750303 3.642617 0.897612
C  -0.355183 -1.914771 2.695393
C  2.69858 0.272012 -0.541153
C  -5.591056 -0.852176 -0.054506
C  3.677867 -0.064824 0.429206
C  2.606652 -0.505956 -1.722764
C  4.553556 -1.152008 0.215708
C  3.482965 -1.594649 -1.93715
C  4.460729 -1.920144 -0.969236
H  -3.512062 1.603272 -1.287125
H  -2.465936 -2.37427 0.079014
H  -0.252743 3.156303 -0.59938
H  -1.885143 3.35694 -1.261689
H  -0.1775 -2.829628 0.721428
H  1.005386 -1.546273 1.037451
H  -4.8205 -0.403202 -2.043478
H  -4.405271 -2.028858 -1.455052
H  2.300671 2.312678 0.092713
H  1.249073 1.718159 -1.244588
H  -2.824736 3.480176 1.097087
H  -1.572095 4.731438 0.828001
H  -1.184252 3.254313 1.762978
H  -0.177004 -0.936889 3.174223
H  0.298779 -2.665117 3.176741
H  -1.406227 -2.206473 2.87619
H  -5.729074 0.199968 0.253966
H  -5.312517 -1.430769 0.844749
H  -6.560622 -1.233615 -0.42418
H  3.741572 0.521806 1.352767
H  1.849026 -0.258239 -2.476233
H  5.308223 -1.399034 0.970958
H  3.403358 -2.184749 -2.857194
H  5.142193 -2.761937 -1.13576
