program: Gaussian 09
title: 000249265
version: EM64L-G09RevD.01
frameworkgroup: C1[X(C11H13BrO)]
method: RPBEPBE
basis: SDD
operation: Freq
keyword: #p
keyword: freq=noraman
keyword: PBEPBE/SDD
title: #p freq=noraman PBEPBE/SDD
converged: YES YES NO NO
title: Mulliken charges:
elementType: Br O C C C C C C C C C C C H H H H H H H H H H H H H
charge: -0.010805 -0.199106 0.049611 0.395540 0.385925 0.596580 -0.558009 -0.680508 -0.841311 -0.820610 0.050045 -0.831590 -0.759136 0.246237 0.262621 0.254061 0.244822 0.222159 0.227908 0.269079 0.252787 0.254485 0.231357 0.242700 0.258456 0.256702
chargesum: 0.00000
title: Mulliken charges with hydrogens summed into heavy atoms:
elementType: Br O C C C C C C C C C C C
charge: -0.010805 -0.199106 0.049611 0.395540 0.385925 0.596580 -0.558009 -0.434272 -0.079808 -0.101464 0.050045 -0.092961 -0.001278
polarizability: 1.90074836e+02 -2.75017163e+00 1.47677147e+02 2.85696800e+00 4.55076785e-01 8.07988990e+01
1716.lowfreq: -3.9934 -0.0008 -0.0007 -0.0002 2.8298 9.0614 48.9715 71.6252 78.9359
frequency: 48.9351 71.6242 78.9202 108.6277 125.1727 147.5480 156.6884 163.1311 189.3521 218.5983 227.6786 252.5755 283.7068 302.9115 314.4877 354.5553 422.6974 487.3141 522.1857 537.4705 546.7468 571.3895 625.8860 633.9740 687.3441 750.3293 880.7275 939.4535 947.4978 968.6046 1003.2982 1020.3012 1032.4684 1039.4265 1043.8591 1049.8429 1053.2218 1056.1807 1202.1660 1256.2815 1314.8903 1344.8273 1368.5462 1377.5869 1401.8874 1403.7063 1404.6640 1420.6363 1440.1489 1449.7808 1462.7018 1465.2636 1467.6832 1473.7361 1480.3607 1485.5288 1555.0272 1598.8034 1605.0602 2979.4198 2983.2081 2984.9558 2985.4384 3061.8264 3063.4439 3067.2316 3072.6750 3093.5805 3094.8262 3104.1886 3122.8069 3127.1554
redmass: 4.1856 3.0352 3.0448 1.3291 1.0734 1.9987 1.5973 1.2926 2.5835 3.2746 3.3686 4.6087 3.7104 3.2560 3.3359 3.0377 3.9258 3.1668 3.7110 3.3233 4.4777 4.2177 4.0579 3.3591 4.2225 3.9613 1.2945 2.6813 2.7176 2.8631 1.5829 1.6153 1.8956 1.6121 1.5248 1.6119 1.7451 2.8507 2.4518 2.0402 7.0167 7.0592 1.2293 4.9680 1.2418 1.2048 1.2096 2.4440 1.0691 1.0713 1.0448 1.0475 1.1037 1.1684 1.1347 1.1604 6.4322 6.4317 8.2565 1.0405 1.0371 1.0387 1.0390 1.0970 1.0958 1.0954 1.0898 1.0995 1.1002 1.0981 1.1027 1.0916
irintensity: 5.4880 1.3426 0.0236 0.6961 0.9029 0.5832 3.4533 0.2445 2.2346 0.4954 5.8141 3.2462 0.5633 2.8805 0.8019 0.3616 0.3058 0.4128 10.5191 4.3783 7.5487 0.8226 2.0633 8.6083 8.5819 0.8217 12.1752 3.6800 23.1736 37.4022 8.1617 9.7474 0.9889 4.4156 0.2003 15.2682 2.3303 24.3279 87.9018 68.9670 6.0227 1.1544 67.1336 19.8955 17.2085 18.3107 2.2975 18.7103 25.4398 21.5325 7.6685 25.4011 10.6930 31.7079 12.4316 9.7458 20.7677 24.4675 128.6834 3.1994 22.4244 29.0810 7.6032 12.5391 8.5723 16.3248 9.9888 14.8786 16.9944 21.3817 10.4751 17.6161
temp: 298.150 k
press: 1.00000 atm
elementType: 35 8 6 6 6 6 6 6 6 6 6 6 6 1 1 1 1 1 1 1 1 1 1 1 1 1
symmnumber: 1
zpe: 541817.3 jmol-1
zpe.correction: 0.206367 hartree
zpe.thermalcorrener: 0.221030 hartree
zpe.thermalcorrenthalpy: 0.221975 hartree
zpe.thermalcorrgfe: 0.164187 hartree
zpe.sumelectzpe: -514.695697 hartree
zpe.sumelectthermal: -514.681034 hartree
zpe.sumelectthermalent: -514.680090 hartree
zpe.sumelectthermalfe: -514.737877 hartree
dipole: 0.4283 0.8234 2.2541
dipole: 2.4377
quadrupole: -94.4845 -76.6418 -90.5469
quadrupole: 0.6059 -8.6583 -1.5264
quadrupole: -7.2601 10.5826 -3.3225 0.6059 -8.6583 -1.5264
hfenergy: -514.9020643 hartree
pointgroup: C01 [X(C11H13Br1O1)]
dipole: -0.278833 -0.3326247 0.8552312 debye
dipolederiv: -0.4380685 0.3238291 0.0231803 0.3687825 -0.3962706 -0.0289882 0.0378701 -0.0210473 -0.0505043 -0.8883922 -0.0082233 0.1777252 0.0600043 -0.3393994 -0.1281287 0.1771314 -0.11853 -0.6778741 -0.5370072 0.0025638 0.0158828 -0.1558883 -0.1700471 -0.0284332 -0.0954012 -0.0472866 -0.1606059 -0.0436795 0.1564182 0.014958 0.176726 0.1086477 -0.0247932 -0.0929442 -0.0308567 0.0270908 0.2038671 -0.2034627 -0.0332779 -0.0466318 0.2364112 0.0222872 0.0743719 0.0587245 0.0076511 0.2069948 0.2692888 0.006136 0.1655103 -0.1026426 -0.0141388 -0.0044768 -0.0165406 0.0496269 0.4792584 -0.6968327 -0.0551285 -0.7565499 0.471421 0.0634268 -0.0561646 0.0533266 -0.1792738 -0.2413695 0.0354108 0.0023855 0.0920776 -0.0191046 0.0053377 -0.0067 0.0024892 -0.1934848 0.0696419 -0.008273 0.003294 -0.0051044 -0.1873481 0.0161473 -0.0311499 0.0168593 0.0531981 -0.092471 0.1690207 0.0315689 0.0922892 -0.0020049 -0.0199178 0.0500864 -0.0383781 0.0224592 1.4035835 0.1569759 -0.0123226 0.1963535 0.2265352 0.2953556 0.059326 0.2842688 0.8964453 -0.1927705 -0.0274129 0.0049732 0.018246 0.1129865 0.0051848 0.0127186 0.0086457 0.0436135 -0.1972303 -0.0766472 -0.1808994 -0.0965497 -0.0151737 -0.0911737 -0.1971017 -0.1467897 -0.4015911 0.0356898 -0.0360405 -0.0002075 -0.0473053 -0.1089376 -0.0137259 -0.0021344 -0.0111705 0.1485291 0.0438708 0.0530571 -0.090063 0.0071317 0.0199363 0.0417926 -0.0587994 0.0728694 0.0168331 0.1073699 -0.0069429 0.0371671 -0.0237152 0.006593 -0.0532445 0.022688 -0.0996567 -0.0558992 -0.1307913 -0.0583331 0.0388586 0.0116211 0.0873693 -0.012542 0.0585486 -0.0104746 0.095153 -0.0298251 0.0461038 -0.1020498 0.017346 0.0558237 -0.0461705 -0.1339519 0.0156386 -0.0302119 0.0358879 -0.1556755 -0.0025266 -0.037947 -0.1107628 -0.0003322 -0.0037845 0.0168974 0.1124837 0.0464598 0.0454757 0.0766036 0.0222634 0.0774059 0.0397958 0.0800742 -0.0155295 -0.0100742 0.0037971 -0.0139591 0.0543353 0.0119602 0.0772953 -0.0749771 0.0961809 -0.0425212 -0.0391347 -0.0059042 -0.0025305 -0.0582187 0.0249133 0.0670209 0.0817501 -0.0939776 0.0515569 -0.0121357 0.0873345 0.0354908 0.0031737 -0.0816633 -0.154179 -0.0099041 -0.0029515 -0.0148913 0.1082876 0.1232035 -0.0116779 -0.0178295 0.0330757 -0.0254885 0.0952255 0.0077652 0.0597542 0.0505077 0.0281357 0.0969532 0.0559488 0.0590518 0.0164115 -0.0910403 0.0733829 -0.0349531 0.0953556 -0.0775857 -0.0845766 0.0063326 -0.105998 0.0675012 -0.0287933 0.0293934 0.0075953 0.0835551 unknown
polarizability: 183.1694381|-15.6642721|153.7920568|-3.5089685|7.8127568|81.5893875 unknown
InChI: InChI=1S/C11H13BrO/c1-6-5-7(2)11(12)8(3)10(6)9(4)13/h5H,1-4H3
charge 0 multiplicity 1
26 atoms
Br -2.877802 2.00858 0.195876
O  3.065449 -0.069182 -0.963476
C  0.829332 -0.07957 -0.022296
C  -0.140298 0.965333 0.045136
C  0.435631 -1.448839 -0.104736
C  -1.947099 -0.758429 0.034703
C  -1.506694 0.58644 0.079101
C  -0.942386 -1.753843 -0.063065
C  0.267998 2.428213 0.018605
C  1.453725 -2.570898 -0.223438
C  2.3122 0.241158 0.00015
C  -3.408512 -1.151874 0.07695
C  2.882783 0.835316 1.285297
H  -1.255647 -2.803549 -0.109091
H  -0.302577 2.972087 -0.754975
H  0.049457 2.929679 0.980407
H  1.337573 2.555686 -0.209821
H  2.201641 -2.540406 0.591265
H  0.957119 -3.554893 -0.188624
H  2.016624 -2.494473 -1.169886
H  -3.894709 -0.794532 1.003452
H  -3.969438 -0.705724 -0.764964
H  -3.520784 -2.247555 0.026257
H  3.017889 0.008442 2.011829
H  2.202156 1.562875 1.756138
H  3.868071 1.290462 1.094102
