program: Gaussian 09
title: 000249263
version: EM64L-G09RevD.01
frameworkgroup: C1[X(C10H14O)]
method: RPBEPBE
basis: SDD
operation: Freq
keyword: #pfreq=noraman
keyword: PBEPBE/SDD
title: #p freq=noraman PBEPBE/SDD
converged: YES YES NO NO
title: Mulliken charges:
elementType: O C C C C C C C C C C H H H H H H H H H H H H H H
charge: -0.183026 -0.367365 -0.466444 0.540359 -0.418268 -0.549674 -0.504578 0.109591 -0.457681 -0.442052 -0.462207 0.261069 0.238241 0.212957 0.213873 0.224962 0.208419 0.241541 0.252490 0.243342 0.216381 0.217731 0.219592 0.211957 0.238790
chargesum: 0.00000
title: Mulliken charges with hydrogens summed into heavy atoms:
elementType: O C C C C C C C C C C
charge: -0.183026 -0.106296 -0.015246 0.540359 0.020567 -0.099714 -0.008746 0.109591 -0.023569 -0.010503 -0.223417
polarizability: 1.29806680e+02 -1.40962012e+00 9.08569874e+01 9.27422616e+00 2.58355316e+00 9.07630862e+01
1716.lowfreq: -16.1071 -8.0906 -0.0007 -0.0007 -0.0005 9.4447 35.8233 60.7179 92.2420
frequency: 34.0033 60.5776 92.2322 135.4444 162.0319 228.0714 268.3116 322.1289 408.6941 456.7433 519.6421 552.7577 592.1929 628.8534 675.0996 761.8646 799.5756 816.9808 828.4182 868.8076 891.3207 896.4867 911.9957 920.3758 948.6436 964.1619 1009.2031 1043.2909 1045.2691 1054.1604 1102.8115 1125.8567 1130.9570 1159.3260 1164.8923 1196.6609 1201.0777 1211.8700 1247.8284 1260.7133 1270.2187 1275.7699 1289.4835 1297.0584 1305.6911 1315.2661 1339.4505 1427.2639 1461.7269 1466.2296 1472.5820 1479.4988 1480.6394 1652.4257 1664.8850 2946.8383 2965.2990 2970.2305 2988.3963 3000.4733 3001.2732 3002.4215 3019.8709 3026.7190 3066.4375 3073.0161 3074.0357 3083.3281 3138.0867
redmass: 3.1246 3.0910 3.3608 2.5357 1.9045 1.9908 3.1450 4.0746 2.8812 3.7336 2.6516 2.8704 2.2928 2.3095 3.2117 3.4319 1.6787 1.5663 1.7667 2.3277 1.7420 2.0167 2.1093 2.2468 1.5734 1.8440 1.7926 1.7765 2.4218 1.9167 2.7175 1.1979 1.8799 1.3636 1.5838 1.4561 1.2483 1.3414 1.7311 1.2924 1.4262 1.4180 1.3859 1.5196 1.4149 1.6811 1.9447 1.0803 1.0874 1.0813 1.0822 1.0993 1.0977 11.3159 7.5992 1.0808 1.0639 1.0596 1.0653 1.0701 1.0693 1.0612 1.0982 1.0890 1.0958 1.0989 1.1039 1.1036 1.0959
irintensity: 0.8007 3.1561 1.9221 3.2633 0.4381 0.6146 0.7373 0.1119 1.9269 4.3100 11.6609 8.2800 4.4091 1.0554 2.3078 3.9522 15.3679 4.3753 15.8021 2.5623 3.5914 5.7977 1.8675 3.7988 12.0599 7.3184 14.3719 4.9274 1.5897 2.2196 18.4265 1.3405 52.8370 7.6631 7.1408 2.2001 2.0106 1.4885 6.2274 2.2041 5.6030 7.3494 3.5736 5.5858 1.3484 7.0963 3.1614 20.6115 3.9686 6.9482 10.2210 3.1871 9.0714 134.9250 20.6901 12.7174 51.8633 37.8166 11.8068 30.0428 27.7660 29.0861 21.8259 60.2928 17.8020 22.6311 53.6400 43.2620 17.2964
temp: 298.150 k
press: 1.00000 atm
elementType: 8 6 6 6 6 6 6 6 6 6 6 1 1 1 1 1 1 1 1 1 1 1 1 1 1
symmnumber: 1
zpe: 563763.8 jmol-1
zpe.correction: 0.214726 hartree
zpe.thermalcorrener: 0.225147 hartree
zpe.thermalcorrenthalpy: 0.226091 hartree
zpe.thermalcorrgfe: 0.177689 hartree
zpe.sumelectzpe: -463.827378 hartree
zpe.sumelectthermal: -463.816958 hartree
zpe.sumelectthermalent: -463.816013 hartree
zpe.sumelectthermalfe: -463.864416 hartree
dipole: 0.8328 -2.8443 0.5338
dipole: 3.0115
quadrupole: -59.8489 -74.6082 -63.5246
quadrupole: -3.1882 0.3706 1.9856
quadrupole: 6.1450 -8.6143 2.4693 -3.1882 0.3706 1.9856
hfenergy: -464.0421046 hartree
pointgroup: C01 [X(C10H14O1)]
dipole: 0.2832123 -1.1400744 0.1541535 debye
dipolederiv: -0.50458 0.1090914 -0.0499436 0.0124012 -0.9833031 0.039316 -0.0624157 0.020746 -0.3222447 -0.232103 -0.1581866 -0.105387 -0.1603119 -0.1715364 -0.0931543 -0.1715232 -0.1602971 0.0695109 -0.0601251 -0.026386 -0.0171725 -0.031066 0.0922739 0.051369 0.0180236 -0.0169663 0.135818 0.2621328 0.0225453 0.0362697 -0.0087705 -0.1663257 0.1049525 -0.066636 0.0912519 0.1436665 0.0198553 -0.0131421 0.0047034 0.0295532 0.0564277 -0.02128 -0.0670617 0.0178534 0.1576396 -0.097117 -0.0015659 0.0296111 -0.0472666 0.1407603 -0.0782781 0.0433628 -0.0682261 -0.0123645 -0.3863332 0.144394 -0.2005327 0.0016576 -0.0507148 0.0039887 -0.2662883 0.0750285 0.0134992 0.8903847 -0.0304595 0.2900776 0.1806418 1.0608467 0.0158364 0.4132029 0.0461827 0.2120066 0.0229971 -0.0356568 -0.0649755 0.0246634 0.1640893 -0.025481 -0.051342 0.016666 0.0351632 -0.0146497 0.0405645 0.0285792 0.0912527 0.2173247 -0.0032263 -0.0057133 -0.0219184 -0.0241887 0.0177756 -0.0502776 -0.0421746 -0.1133843 -0.2372541 0.0054065 -0.0176111 0.0397267 -0.0124175 0.0416022 -0.0111875 0.0235555 -0.0029315 0.0504842 -0.0007419 0.0730572 0.0135766 -0.1002009 0.0391705 -0.0592489 -0.0285072 -0.0399273 -0.1189673 -0.0630511 -0.0191807 -0.1038366 0.0411668 0.0338674 -0.0123913 0.0680277 -0.0124398 0.0710509 -0.0071173 0.081943 0.0517383 -0.1325919 0.027528 0.0030282 0.0558321 -0.0105164 0.039731 -0.0282762 0.1277552 -0.0663106 -0.1304491 -0.0645961 0.0927099 -0.0786637 0.0892766 -0.0150807 0.0662238 -0.1131285 0.0982917 0.0001316 0.0054534 0.0539205 -0.0902245 0.0610616 0.0211293 0.1155829 -0.109316 0.070963 -0.0796682 0.0499788 -0.0537955 0.0054575 -0.0656909 -0.0992701 -0.0817536 -0.0460866 -0.0230015 0.0309962 -0.0349883 -0.0748185 0.0394501 -0.0759495 -0.0109198 0.0378853 0.0817278 0.0348425 0.0874257 0.0894455 0.0257867 0.0285429 0.0471864 0.0554243 -0.0218623 -0.0118685 -0.0601267 -0.0794265 -0.0403899 0.0767754 0.0892025 0.1122084 -0.0176853 -0.1097038 0.0962102 -0.0817693 -0.023129 0.0371539 -0.0344268 0.0100346 -0.0961909 -0.1259166 0.1134469 0.0159706 0.0665637 0.0171811 -0.0298732 0.062537 -0.0403879 0.1492041 -0.1143482 0.087385 0.0248987 0.0562704 0.0394229 -0.1239387 -0.0958698 -0.0637963 -0.1615253 -0.0093589 -0.0567922 -0.0233279 -0.0418375 0.0498886 0.0513489 0.0260599 0.0724218 0.026864 0.1511388 -0.0506749 0.0553474 -0.0554114 -0.116836 unknown
polarizability: 129.737173|-3.4039003|90.8227588|8.9899558|2.2306606|90.866822 unknown
InChI: InChI=1S/C10H14O/c11-10-7-3-6-9(10)8-4-1-2-5-8/h4,9H,1-3,5-7H2
charge 0 multiplicity 1
25 atoms
O  1.189979 2.050705 -0.190768
C  0.60696 -0.355205 -0.540431
C  1.315712 -1.576857 0.11889
C  -0.857362 -0.171872 -0.22735
C  2.827437 -1.213495 0.071002
C  -1.359877 0.216682 1.164054
C  2.855093 0.300995 0.386077
C  1.509627 0.840964 -0.12793
C  -2.901465 -0.005939 1.069768
C  -3.233144 0.042799 -0.457341
C  -1.890662 -0.255937 -1.108334
H  0.727101 -0.444816 -1.643291
H  1.081692 -2.52038 -0.40182
H  0.980345 -1.681836 1.168718
H  3.22528 -1.39816 -0.945007
H  3.428783 -1.810807 0.77728
H  -0.900372 -0.377328 1.977885
H  -1.110429 1.279079 1.362541
H  3.698325 0.858765 -0.056655
H  2.889688 0.482463 1.479642
H  -3.473055 0.737481 1.652108
H  -3.154176 -1.00727 1.464968
H  -3.595202 1.046187 -0.764837
H  -4.022435 -0.679057 -0.74094
H  -1.781642 -0.463262 -2.179329
