program: Gaussian 09
title: 000249261
version: EM64L-G09RevD.01
frameworkgroup: C1[X(C9H17NO)]
method: RPBEPBE
basis: SDD
operation: Freq
keyword: #p
keyword: freq=noraman
keyword: PBEPBE/SDD
title: #p freq=noraman PBEPBE/SDD
converged: NO YES NO NO
title: Mulliken charges:
elementType: O N C C C C C C C C C H H H H H H H H H H H H H H H H H
charge: -0.291789 -0.117791 -0.363780 -0.346014 -0.333461 -0.453309 -0.691629 0.221678 -0.018058 -0.787409 -0.581966 0.222103 0.226714 0.199315 0.197640 0.197030 0.194511 0.271515 0.204797 0.212920 0.218999 0.212667 0.238913 0.266519 0.234893 0.231584 0.218874 0.214533
chargesum: 0.00000
title: Mulliken charges with hydrogens summed into heavy atoms:
elementType: O N C C C C C C C C C
charge: -0.291789 -0.117791 0.085037 0.050941 0.058080 0.023003 -0.047042 0.221678 0.220855 -0.054412 -0.148559
polarizability: 1.13069649e+02 -6.50489339e+00 1.28686443e+02 -1.89726208e+00 1.23913891e+00 8.30804639e+01
1716.lowfreq: -11.0819 -8.4148 -0.0005 -0.0005 -0.0002 7.5373 33.5027 48.9518 56.4459
frequency: 33.3781 48.6966 56.2185 75.8992 82.1426 119.8720 128.9988 143.1429 203.7345 231.3548 252.0835 304.4110 349.7088 370.3048 403.8750 436.3446 487.3271 571.1874 585.9343 656.7350 732.6830 758.0402 790.3899 898.2460 905.7462 918.2573 927.5488 950.1208 975.4955 1004.7081 1012.3699 1029.6086 1039.6196 1070.2680 1105.1689 1114.7326 1160.9869 1190.8334 1222.1762 1263.2037 1263.6087 1279.9217 1286.7551 1290.3132 1332.3960 1342.5489 1358.5972 1373.8736 1391.3107 1407.7032 1429.3966 1446.5010 1456.3383 1467.1621 1471.9942 1476.2091 1478.0050 1484.3699 1491.0883 1590.8144 1654.4640 2963.1784 2974.0240 2975.8445 2986.1531 2989.3586 2996.0800 3004.2032 3031.3051 3051.0939 3062.5146 3072.3051 3074.9166 3076.8186 3084.7169 3106.1815 3130.2446 3195.4911
redmass: 3.3179 3.0581 1.7175 3.8573 2.9651 2.5387 2.2921 1.0466 2.7368 1.1032 3.0222 3.7864 2.7228 2.9072 2.0048 3.1337 2.2218 3.4421 2.5509 2.3727 1.0794 2.8519 1.2261 1.7280 1.6448 1.9601 1.3238 1.3508 1.8399 1.2548 2.9705 1.6750 1.8945 2.5055 1.9966 2.1715 2.1740 2.7462 1.5398 1.5270 1.2933 1.2386 1.0978 1.2532 1.2700 1.4363 1.4203 1.2141 1.2154 2.2950 1.2557 1.0953 1.0896 1.0815 1.0652 1.0666 1.0423 1.0821 1.1074 6.2528 4.5627 1.0590 1.0501 1.0453 1.0595 1.0385 1.0636 1.0979 1.1012 1.1010 1.1026 1.1009 1.0994 1.0977 1.0600 1.0947 1.0984 1.1140
irintensity: 0.0699 0.6402 0.6572 3.1420 1.7542 2.1845 0.9541 0.3632 0.4470 0.0300 1.8484 6.9304 0.4475 2.6187 7.1716 11.3573 3.6639 5.4901 6.7940 13.5192 10.4804 2.1077 0.8420 7.9783 3.4021 16.9339 8.0000 77.4739 22.9998 20.8327 5.7238 6.6400 8.9849 0.5623 9.2195 17.2218 20.6197 9.4189 37.6164 77.8700 5.0539 5.8765 6.6501 3.4007 1.9837 3.1517 19.4944 28.1247 9.8083 118.7766 0.6782 50.2146 25.6567 4.6868 2.2940 16.0207 13.2028 6.7281 16.9018 287.4223 16.9444 19.3907 16.7810 39.4601 48.8293 7.1390 43.7981 2.6378 18.9317 12.8276 14.9782 90.5794 49.7254 19.2182 13.0626 9.5492 10.8018 27.2010
temp: 298.150 k
press: 1.00000 atm
elementType: 8 7 6 6 6 6 6 6 6 6 6 1 1 1 1 1 1 1 1 1 1 1 1 1 1 1 1 1
symmnumber: 1
zpe: 640955.3 jmol-1
zpe.correction: 0.244127 hartree
zpe.thermalcorrener: 0.258029 hartree
zpe.thermalcorrenthalpy: 0.258974 hartree
zpe.thermalcorrgfe: 0.202091 hartree
zpe.sumelectzpe: -482.224006 hartree
zpe.sumelectthermal: -482.210103 hartree
zpe.sumelectthermalent: -482.209159 hartree
zpe.sumelectthermalfe: -482.266042 hartree
dipole: -3.7667 1.5632 1.7179
dipole: 4.4252
quadrupole: -78.2673 -68.1758 -68.9538
quadrupole: 6.7608 4.6574 -3.8602
quadrupole: -6.4683 3.6231 2.8452 6.7608 4.6574 -3.8602
hfenergy: -482.4681328 hartree
pointgroup: C01 [X(C9H17N1O1)]
dipole: -1.3792481 0.817606 0.6784772 debye
polarizability: 111.5788311|-4.1748933|130.1744904|-1.899211|1.018887|83.0832348 unknown
InChI: InChI=1S/C9H17NO/c1-4-6-8-10(7-5-2)9(3)11/h5H,2,4,6-8H2,1,3H3
charge 0 multiplicity 1
28 atoms
O  2.101566 -2.093183 -0.703758
N  0.66022 -0.400673 -0.00652
C  -0.567797 0.073068 0.667712
C  -1.800605 0.148952 -0.266776
C  -3.044172 0.723261 0.448896
C  1.469802 0.615352 -0.728774
C  -4.280251 0.79819 -0.473092
C  1.057914 -1.736581 -0.068591
C  2.191279 1.550374 0.221512
C  0.200643 -2.760943 0.677051
C  2.040811 2.898719 0.237853
H  -0.793398 -0.578862 1.530164
H  -0.356963 1.078969 1.08003
H  -2.030125 -0.861515 -0.660543
H  -1.557599 0.779024 -1.145929
H  -2.809543 1.73576 0.836519
H  -3.281109 0.098714 1.334835
H  2.199012 0.046104 -1.334604
H  0.81807 1.193414 -1.412109
H  -4.554294 -0.204088 -0.852451
H  -5.156926 1.208889 0.060208
H  -4.083653 1.445152 -1.348568
H  2.881674 1.063564 0.925788
H  0.58332 -3.759654 0.420949
H  0.27814 -2.626565 1.77209
H  -0.866784 -2.701691 0.400321
H  2.603941 3.533454 0.930987
H  1.360827 3.408596 -0.457395
