program: Gaussian 09
title: 000249260
version: EM64L-G09RevD.01
frameworkgroup: C1[X(C9H12O6)]
method: RPBEPBE
basis: SDD
operation: Freq
keyword: #pfreq=noraman
keyword: PBEPBE/SDD
title: #p freq=noraman PBEPBE/SDD
converged: YES YES NO NO
title: Mulliken charges:
elementType: O O O O O O C C C C C C C C C H H H H H H H H H H H H
charge: -0.263083 -0.278193 -0.265342 -0.236467 -0.238567 -0.254934 -0.639246 0.380420 -0.415032 0.271746 0.161999 0.235347 -0.501088 -0.501519 -0.502794 0.266212 0.315250 0.291321 0.243052 0.240655 0.234219 0.234181 0.250411 0.244714 0.245223 0.243378 0.238138
chargesum: 0.00000
title: Mulliken charges with hydrogens summed into heavy atoms:
elementType: O O O O O O C C C C C C C C C
charge: -0.263083 -0.278193 -0.265342 -0.236467 -0.238567 -0.254934 -0.057784 0.380420 -0.123712 0.271746 0.161999 0.235347 0.216838 0.227787 0.223945
polarizability: 1.75226745e+02 3.74218110e+00 1.15746757e+02 -7.65731721e+00 9.13022765e+00 8.22131195e+01
1716.lowfreq: -7.6254 -5.2452 -0.0008 -0.0006 0.0005 2.8497 24.1172 29.4731 49.2182
frequency: 24.0148 29.4705 49.2069 59.7456 77.4922 98.2969 101.1990 103.9053 106.3090 122.2530 152.1459 170.7555 211.9745 232.6789 259.1004 273.6589 282.9387 315.4273 342.7670 365.6053 451.4114 544.7108 549.9963 628.5105 636.6815 701.8015 707.0919 735.9793 791.4810 855.9903 867.6756 919.9144 939.6728 955.8761 970.3234 998.2548 1088.3876 1112.6459 1113.0884 1115.4020 1123.2051 1141.9337 1148.9326 1150.9888 1154.5165 1182.2846 1264.1202 1318.6515 1364.1735 1421.3511 1422.6375 1422.9078 1436.5350 1452.1225 1452.3333 1452.6631 1460.9214 1462.1569 1464.2706 1606.6020 1617.9366 1646.8992 1661.6662 3004.8136 3005.0863 3006.9442 3012.5247 3075.5988 3105.8957 3107.1673 3110.3085 3149.6352 3153.2415 3153.3057 3157.7236
redmass: 4.3246 6.2359 6.5299 4.6273 3.3315 2.6053 1.1958 1.1331 1.5359 2.5975 3.8288 4.3760 3.6158 4.7795 4.7923 8.0192 3.3080 3.8198 4.6933 6.0082 4.8973 3.4806 5.5856 5.8295 5.1801 5.0641 5.3225 8.3106 5.6625 6.1981 6.0963 5.4824 3.3625 1.4824 5.2787 4.9316 2.5348 1.2685 1.2700 1.2690 3.5356 3.2085 1.4427 1.4806 1.7061 2.0553 2.0909 1.5080 1.9434 1.1833 1.1882 1.1956 1.1101 1.0495 1.0493 1.0502 1.0513 1.0515 1.0504 8.5645 10.0398 8.7865 8.4905 1.0300 1.0298 1.0294 1.0595 1.0995 1.1043 1.1046 1.1046 1.1048 1.1046 1.1050 1.0908
irintensity: 0.6635 1.8917 1.8230 3.2917 0.2005 1.2734 0.1971 0.4796 0.5369 0.3195 5.2754 0.4702 2.1664 7.9728 15.6922 2.0429 45.0875 18.1911 3.9521 4.4061 4.0500 2.1174 19.3217 4.5195 0.3335 3.3295 4.0785 32.2523 8.2879 3.4846 23.7352 4.7128 9.3102 29.4112 29.5472 123.9794 98.0717 0.8547 0.4467 0.0834 465.7877 32.2950 8.6887 62.6829 15.9721 229.2238 359.1722 53.6815 21.9222 23.5509 19.3370 20.7195 57.8202 9.6980 17.6217 17.1904 11.9503 11.0353 11.9781 222.5098 42.8201 162.5085 26.8167 49.3980 25.7247 28.5692 16.1916 14.6963 24.2235 25.7958 20.8986 16.5071 20.9728 10.9292 1.0180
temp: 298.150 k
press: 1.00000 atm
elementType: 8 8 8 8 8 8 6 6 6 6 6 6 6 6 6 1 1 1 1 1 1 1 1 1 1 1 1
symmnumber: 1
zpe: 531954.8 jmol-1
zpe.correction: 0.202611 hartree
zpe.thermalcorrener: 0.220042 hartree
zpe.thermalcorrenthalpy: 0.220987 hartree
zpe.thermalcorrgfe: 0.154580 hartree
zpe.sumelectzpe: -800.327770 hartree
zpe.sumelectthermal: -800.310339 hartree
zpe.sumelectthermalent: -800.309395 hartree
zpe.sumelectthermalfe: -800.375801 hartree
dipole: 0.9076 -0.7413 -1.4385
dipole: 1.8554
quadrupole: -58.2117 -86.3991 -91.8238
quadrupole: 2.2956 -2.2714 -5.8953
quadrupole: 20.5998 -7.5875 -13.0123 2.2956 -2.2714 -5.8953
hfenergy: -800.5303814 hartree
pointgroup: C01 [X(C9H12O6)]
dipole: -0.3227637 -0.3256273 0.5680273 debye
polarizability: 174.8454866|7.944202|115.3807282|-1.718995|-11.7154523|82.9604067 unknown
InChI: InChI=1S/C9H12O6/c1-13-7(10)4-6(9(12)15-3)5-8(11)14-2/h4H,5H2,1-3H3
charge 0 multiplicity 1
27 atoms
O  -1.750225 -2.644487 0.487089
O  -2.301293 1.114214 0.230507
O  3.647587 0.987238 -0.261781
O  -1.23007 -1.451561 -1.445336
O  -0.909535 2.654698 -0.825854
O  2.65808 -0.878803 0.723932
C  -0.356434 -0.725754 0.767444
C  0.031397 0.602856 0.157349
C  1.308062 1.022196 -0.095144
C  -1.143084 -1.596313 -0.206613
C  -1.0609 1.569756 -0.215633
C  2.542474 0.251778 0.181187
C  -2.504867 -3.609895 -0.348578
C  -3.458953 1.97139 -0.116909
C  4.966091 0.341123 -0.062959
H  -0.980687 -0.578472 1.666091
H  0.549705 -1.279897 1.070487
H  1.455033 2.008125 -0.549428
H  -1.836167 -4.076949 -1.090962
H  -3.327302 -3.096974 -0.874872
H  -2.890272 -4.353749 0.362474
H  -4.323965 1.476347 0.345258
H  -3.568097 2.026328 -1.212848
H  -3.314722 2.987921 0.285822
H  5.00635 -0.617051 -0.607905
H  5.140478 0.15356 1.010021
H  5.693314 1.059177 -0.465743
